BDBM50100337 CHEMBL2371766::RO-09-3655 derivative
SMILES: [H][C@@]12C[C@@H](O)CN1C(=O)[C@@H](NC(=O)[C@H](Cc1ccc(O)cc1)NC(=O)[C@@H](C)NC(=O)[C@@]([H])(NC(=O)C[C@@H](CCCCCCCCCCCCC)OC(=O)[C@H](CCCNC(=O)[C@H](CCCN)N(CCN)CCN)NC(=O)[C@@]([H])(NC(=O)CNC(=O)[C@@]([H])(NC(=O)[C@]1([H])[C@@H](O)CCN1C(=O)[C@@]([H])(NC(=O)[C@@]([H])(NC2=O)[C@@H](C)O)[C@@H](C)O)[C@H](O)CC(N)=O)[C@@H](C)O)[C@@H](C)O)C(C)C
InChI Key: InChIKey=DYPMRZHFCFUAIU-FEISLUKOSA-N
Data: 1 IC50
Activity Spreadsheet -- Enzyme Inhibition Constant Data from BindingDB
Found 1 hit for monomerid = 50100337
Trg + Lig
Ki
nM
ΔG°
kcal/mole
IC50
nM
Kd
nM
EC50/IC50
nM
koff
s-1
kon
M-1s-1
pHTemp
°C
Glucan Synthase
(Candida albicans (Yeast))
BDBM50100337
(CHEMBL2371766 | RO-09-3655 derivative)
Show SMILES [H][C@@]12C[C@@H](O)CN1C(=O)[C@@H](NC(=O)[C@H](Cc1ccc(O)cc1)NC(=O)[C@@H](C)NC(=O)[C@@]([H])(NC(=O)C[C@@H](CCCCCCCCCCCCC)OC(=O)[C@H](CCCNC(=O)[C@H](CCCN)N(CCN)CCN)NC(=O)[C@@]([H])(NC(=O)CNC(=O)[C@@]([H])(NC(=O)[C@]1([H])[C@@H](O)CCN1C(=O)[C@@]([H])(NC(=O)[C@@]([H])(NC2=O)[C@@H](C)O)[C@@H](C)O)[C@H](O)CC(N)=O)[C@@H](C)O)[C@@H](C)O)C(C)C
Show InChI InChI=1S/C80H136N18O24/c1-9-10-11-12-13-14-15-16-17-18-19-22-52-39-60(108)90-63(45(5)99)74(115)87-44(4)69(110)89-54(37-49-25-27-50(103)28-26-49)70(111)92-62(43(2)3)78(119)98-42-51(104)38-56(98)72(113)93-65(47(7)101)76(117)94-66(48(8)102)79(120)97-34-29-57(105)68(97)77(118)95-67(58(106)40-59(84)107)73(114)86-41-61(109)91-64(46(6)100)75(116)88-53(80(121)122-52)23-21-33-85-71(112)55(24-20-30-81)96(35-31-82)36-32-83/h25-28,43-48,51-58,62-68,99-106H,9-24,29-42,81-83H2,1-8H3,(H2,84,107)(H,85,112)(H,86,114)(H,87,115)(H,88,116)(H,89,110)(H,90,108)(H,91,109)(H,92,111)(H,93,113)(H,94,117)(H,95,118)/t44-,45-,46-,47-,48-,51-,52-,53+,54+,55+,56+,57+,58-,62+,63+,64+,65+,66+,67+,68+/m1/s1
n/an/a 0.900n/an/an/an/an/an/a
Nippon Roche Research Center
Curated by ChEMBL
Assay Description
In vitro inhibitory activity against Beta glucan synthase
Bioorg Med Chem Lett 11: 1273-6 (2001)
BindingDB Entry DOI: 10.7270/Q2CN74FQ