BDBM50100339 CHEMBL438198::FR-901469::FR901469::Lipopeptidolactone FR901469
SMILES: CCCCCCCCCCCCC[C@@H]1CC(=O)N[C@H]([C@@H](C)O)C(=O)N[C@H](C)C(=O)N[C@@H](Cc2ccc(O)cc2)C(=O)N[C@@H](C(C)C)C(=O)N2C[C@H](O)C[C@H]2C(=O)N[C@H]([C@@H](C)O)C(=O)N[C@@H]([C@@H](C)O)C(=O)N2CC[C@H](O)[C@H]2C(=O)N[C@@H]([C@H](O)CC(N)=O)C(=O)NCC(=O)N[C@H]([C@@H](C)O)C(=O)N[C@@H](CCCN)C(=O)O1
InChI Key: InChIKey=LTLDDYQPSWDOBJ-UNEDFBIISA-N
Data: 1 IC50
Activity Spreadsheet -- Enzyme Inhibition Constant Data from BindingDB
Found 1 hit for monomerid = 50100339
Trg + Lig
Ki
nM
ΔG°
kcal/mole
IC50
nM
Kd
nM
EC50/IC50
nM
koff
s-1
kon
M-1s-1
pHTemp
°C
Glucan Synthase
(Candida albicans (Yeast))
BDBM50100339
(CHEMBL438198 | FR-901469 | FR901469 | Lipopeptidol...)
Show SMILES CCCCCCCCCCCCC[C@@H]1CC(=O)N[C@H]([C@@H](C)O)C(=O)N[C@H](C)C(=O)N[C@@H](Cc2ccc(O)cc2)C(=O)N[C@@H](C(C)C)C(=O)N2C[C@H](O)C[C@H]2C(=O)N[C@H]([C@@H](C)O)C(=O)N[C@@H]([C@@H](C)O)C(=O)N2CC[C@H](O)[C@H]2C(=O)N[C@@H]([C@H](O)CC(N)=O)C(=O)NCC(=O)N[C@H]([C@@H](C)O)C(=O)N[C@@H](CCCN)C(=O)O1
Show InChI InChI=1S/C71H116N14O23/c1-9-10-11-12-13-14-15-16-17-18-19-21-45-32-52(95)78-55(38(5)86)65(101)75-37(4)61(97)77-47(30-42-23-25-43(90)26-24-42)62(98)80-54(36(2)3)69(105)85-35-44(91)31-48(85)63(99)81-57(40(7)88)67(103)82-58(41(8)89)70(106)84-29-27-49(92)60(84)68(104)83-59(50(93)33-51(73)94)64(100)74-34-53(96)79-56(39(6)87)66(102)76-46(22-20-28-72)71(107)108-45/h23-26,36-41,44-50,54-60,86-93H,9-22,27-35,72H2,1-8H3,(H2,73,94)(H,74,100)(H,75,101)(H,76,102)(H,77,97)(H,78,95)(H,79,96)(H,80,98)(H,81,99)(H,82,103)(H,83,104)/t37-,38-,39-,40-,41-,44-,45-,46+,47+,48+,49+,50-,54+,55-,56-,57-,58+,59+,60+/m1/s1
n/an/a 8.5n/an/an/an/an/an/a
Nippon Roche Research Center
Curated by ChEMBL
Assay Description
In vitro inhibitory activity against Beta glucan synthase
Bioorg Med Chem Lett 11: 1273-6 (2001)
BindingDB Entry DOI: 10.7270/Q2CN74FQ