null
SMILES: CCCCS(=O)(=O)N[C@@H](CCC(=O)N1CCC2(CC1)CCN(CC2)c1ccncc1)C(O)=O
InChI Key: InChIKey=RABJRVWIRCPRHL-FQEVSTJZSA-N
Activity Spreadsheet -- Enzyme Inhibition Constant Data from BindingDB
Found 2 hits for monomerid = 50100347
Trg + Lig
Ki
nM
ΔG°
kcal/mole
IC50
nM
Kd
nM
EC50/IC50
nM
koff
s-1
kon
M-1s-1
pHTemp
°C
Integrin alpha-V/beta-3
(Homo sapiens (Human))
BDBM50100347
((S)-2-(Butane-1-sulfonylamino)-5-oxo-5-(9-pyridin-...)
Show SMILES CCCCS(=O)(=O)N[C@@H](CCC(=O)N1CCC2(CC1)CCN(CC2)c1ccncc1)C(O)=O
Show InChI InChI=1S/C23H36N4O5S/c1-2-3-18-33(31,32)25-20(22(29)30)4-5-21(28)27-16-10-23(11-17-27)8-14-26(15-9-23)19-6-12-24-13-7-19/h6-7,12-13,20,25H,2-5,8-11,14-18H2,1H3,(H,29,30)/t20-/m0/s1
n/an/a>1.00E+5n/an/an/an/an/an/a
COR Therapeutics, Inc
Curated by ChEMBL
Assay Description
Inhibitory concentration of the compound against alphaV-beta3 integrin
Bioorg Med Chem Lett 11: 1289-92 (2001)
BindingDB Entry DOI: 10.7270/Q22N51KQ
Integrin alpha-IIb/beta-3
(Homo sapiens (Human))
BDBM50100347
((S)-2-(Butane-1-sulfonylamino)-5-oxo-5-(9-pyridin-...)
Show SMILES CCCCS(=O)(=O)N[C@@H](CCC(=O)N1CCC2(CC1)CCN(CC2)c1ccncc1)C(O)=O
Show InChI InChI=1S/C23H36N4O5S/c1-2-3-18-33(31,32)25-20(22(29)30)4-5-21(28)27-16-10-23(11-17-27)8-14-26(15-9-23)19-6-12-24-13-7-19/h6-7,12-13,20,25H,2-5,8-11,14-18H2,1H3,(H,29,30)/t20-/m0/s1
n/an/a 23n/an/an/an/an/an/a
COR Therapeutics, Inc
Curated by ChEMBL
Assay Description
Inhibition of binding of fibrinogen to purified human GPIIb-IIIa in ELISA
Bioorg Med Chem Lett 11: 1289-92 (2001)
BindingDB Entry DOI: 10.7270/Q22N51KQ