BDBM50100351 (S)-2-Benzyloxycarbonylamino-5-oxo-5-(9-pyridin-4-yl-3,9-diaza-spiro[5.5]undec-3-yl)-pentanoic acid::CHEMBL417836
SMILES: OC(=O)[C@H](CCC(=O)N1CCC2(CC1)CCN(CC2)c1ccncc1)NC(=O)OCc1ccccc1
InChI Key: InChIKey=OYCLLPDCZQPWQL-QHCPKHFHSA-N
Data: 2 IC50
Activity Spreadsheet -- Enzyme Inhibition Constant Data from BindingDB
Found 2 hits for monomerid = 50100351
Trg + Lig
Ki
nM
ΔG°
kcal/mole
IC50
nM
Kd
nM
EC50/IC50
nM
koff
s-1
kon
M-1s-1
pHTemp
°C
Integrin alpha-IIb/beta-3
(Homo sapiens (Human))
BDBM50100351
((S)-2-Benzyloxycarbonylamino-5-oxo-5-(9-pyridin-4-...)
Show SMILES OC(=O)[C@H](CCC(=O)N1CCC2(CC1)CCN(CC2)c1ccncc1)NC(=O)OCc1ccccc1
Show InChI InChI=1S/C27H34N4O5/c32-24(7-6-23(25(33)34)29-26(35)36-20-21-4-2-1-3-5-21)31-18-12-27(13-19-31)10-16-30(17-11-27)22-8-14-28-15-9-22/h1-5,8-9,14-15,23H,6-7,10-13,16-20H2,(H,29,35)(H,33,34)/t23-/m0/s1
n/an/a 7n/an/an/an/an/an/a
COR Therapeutics, Inc
Curated by ChEMBL
Assay Description
Inhibition of binding of fibrinogen to purified human GPIIb-IIIa in ELISA
Bioorg Med Chem Lett 11: 1289-92 (2001)
BindingDB Entry DOI: 10.7270/Q22N51KQ
ITGAV/ITGB3
(Homo sapiens (Human))
BDBM50100351
((S)-2-Benzyloxycarbonylamino-5-oxo-5-(9-pyridin-4-...)
Show SMILES OC(=O)[C@H](CCC(=O)N1CCC2(CC1)CCN(CC2)c1ccncc1)NC(=O)OCc1ccccc1
Show InChI InChI=1S/C27H34N4O5/c32-24(7-6-23(25(33)34)29-26(35)36-20-21-4-2-1-3-5-21)31-18-12-27(13-19-31)10-16-30(17-11-27)22-8-14-28-15-9-22/h1-5,8-9,14-15,23H,6-7,10-13,16-20H2,(H,29,35)(H,33,34)/t23-/m0/s1
n/an/a>1.00E+5n/an/an/an/an/an/a
COR Therapeutics, Inc
Curated by ChEMBL
Assay Description
Inhibition of binding of fibrinogen to purified human GPIIb-IIIa in ELISA
Bioorg Med Chem Lett 11: 1289-92 (2001)
BindingDB Entry DOI: 10.7270/Q22N51KQ