null
SMILES: COC(=O)c1[nH]c(=O)c2cc(OC)c(OC)cc2c1-c1cc(OC)c(OC)c(OC)c1
InChI Key: InChIKey=VCYNRZGDEXCOND-UHFFFAOYSA-N
Activity Spreadsheet -- Enzyme Inhibition Constant Data from BindingDB
Found 3 hits for monomerid = 50100657
Trg + Lig
Ki
nM
ΔG°
kcal/mole
IC50
nM
Kd
nM
EC50/IC50
nM
koff
s-1
kon
M-1s-1
pHTemp
°C
Dual specificity calcium/calmodulin-dependent 3',5'-cyclic nucleotide phosphodiesterase 1B/Dual specificity calcium/calmodulin-dependent 3',5'-cyclic nucleotide phosphodiesterase 1C/Phosphodiesterase
(Rattus norvegicus)
BDBM50100657
(6,7-Dimethoxy-1-oxo-4-(3,4,5-trimethoxy-phenyl)-1,...)
Show SMILES COC(=O)c1[nH]c(=O)c2cc(OC)c(OC)cc2c1-c1cc(OC)c(OC)c(OC)c1
Show InChI InChI=1S/C22H23NO8/c1-26-14-9-12-13(10-15(14)27-2)21(24)23-19(22(25)31-6)18(12)11-7-16(28-3)20(30-5)17(8-11)29-4/h7-10H,1-6H3,(H,23,24)
n/an/a>1.00E+4n/an/an/an/an/an/a
Tanabe Seiyaku Co., Ltd.
Curated by ChEMBL
Assay Description
Inhibitory activity against rat heart Phosphodiesterase 1(PDE1)
J Med Chem 44: 2204-18 (2001)
BindingDB Entry DOI: 10.7270/Q2QR4XT5
cGMP-inhibited 3',5'-cyclic phosphodiesterase 3A/3B
(Homo sapiens (Human))
BDBM50100657
(6,7-Dimethoxy-1-oxo-4-(3,4,5-trimethoxy-phenyl)-1,...)
Show SMILES COC(=O)c1[nH]c(=O)c2cc(OC)c(OC)cc2c1-c1cc(OC)c(OC)c(OC)c1
Show InChI InChI=1S/C22H23NO8/c1-26-14-9-12-13(10-15(14)27-2)21(24)23-19(22(25)31-6)18(12)11-7-16(28-3)20(30-5)17(8-11)29-4/h7-10H,1-6H3,(H,23,24)
n/an/a>1.00E+4n/an/an/an/an/an/a
Tanabe Seiyaku Co., Ltd.
Curated by ChEMBL
Assay Description
Inhibitory activity against canine heart Phosphodiesterase 3 (PDE3)
J Med Chem 44: 2204-18 (2001)
BindingDB Entry DOI: 10.7270/Q2QR4XT5
cGMP-specific 3',5'-cyclic phosphodiesterase
(Canis lupus familiaris)
BDBM50100657
(6,7-Dimethoxy-1-oxo-4-(3,4,5-trimethoxy-phenyl)-1,...)
Show SMILES COC(=O)c1[nH]c(=O)c2cc(OC)c(OC)cc2c1-c1cc(OC)c(OC)c(OC)c1
Show InChI InChI=1S/C22H23NO8/c1-26-14-9-12-13(10-15(14)27-2)21(24)23-19(22(25)31-6)18(12)11-7-16(28-3)20(30-5)17(8-11)29-4/h7-10H,1-6H3,(H,23,24)
Reactome pathway
n/an/a 900n/an/an/an/an/an/a
Tanabe Seiyaku Co., Ltd.
Curated by ChEMBL
Assay Description
Inhibitory activity against canine lung Phosphodiesterase 5 (PDE5)
J Med Chem 44: 2204-18 (2001)
BindingDB Entry DOI: 10.7270/Q2QR4XT5