null
SMILES: CC1CCC(C)N1C(=O)C(C)(C)c1ccc2[nH]c(c(CCNCCCCc3ccc(NS(C)(=O)=O)cc3)c2c1)-c1cc(C)cc(C)c1
InChI Key: InChIKey=CERGKSWDFXQEKG-UHFFFAOYSA-N
Activity Spreadsheet -- Enzyme Inhibition Constant Data from BindingDB
Found 3 hits for monomerid = 50101164
Trg + Lig
Ki
nM
ΔG°
kcal/mole
IC50
nM
Kd
nM
EC50/IC50
nM
koff
s-1
kon
M-1s-1
pHTemp
°C
Gonadotropin-releasing hormone receptor
(Rattus norvegicus)
BDBM50101164
(CHEMBL295152 | N-{4-[4-(2-{2-(3,5-Dimethyl-phenyl)...)
Show SMILES CC1CCC(C)N1C(=O)C(C)(C)c1ccc2[nH]c(c(CCNCCCCc3ccc(NS(C)(=O)=O)cc3)c2c1)-c1cc(C)cc(C)c1
Show InChI InChI=1S/C39H52N4O3S/c1-26-22-27(2)24-31(23-26)37-34(19-21-40-20-9-8-10-30-13-16-33(17-14-30)42-47(7,45)46)35-25-32(15-18-36(35)41-37)39(5,6)38(44)43-28(3)11-12-29(43)4/h13-18,22-25,28-29,40-42H,8-12,19-21H2,1-7H3
n/an/a 3n/an/an/an/an/an/a
Merck Research Laboratories
Curated by ChEMBL
Assay Description
Inhibition of [125I]-buserelin binding to rat pituitary Gonadotropin-releasing hormone receptor, in the absence of bovine serum albumin (BSA)
Bioorg Med Chem Lett 11: 1723-6 (2001)
BindingDB Entry DOI: 10.7270/Q2KH0MK4
Gonadotropin-releasing hormone receptor
(Rattus norvegicus)
BDBM50101164
(CHEMBL295152 | N-{4-[4-(2-{2-(3,5-Dimethyl-phenyl)...)
Show SMILES CC1CCC(C)N1C(=O)C(C)(C)c1ccc2[nH]c(c(CCNCCCCc3ccc(NS(C)(=O)=O)cc3)c2c1)-c1cc(C)cc(C)c1
Show InChI InChI=1S/C39H52N4O3S/c1-26-22-27(2)24-31(23-26)37-34(19-21-40-20-9-8-10-30-13-16-33(17-14-30)42-47(7,45)46)35-25-32(15-18-36(35)41-37)39(5,6)38(44)43-28(3)11-12-29(43)4/h13-18,22-25,28-29,40-42H,8-12,19-21H2,1-7H3
n/an/a 0.200n/an/an/an/an/an/a
Merck Research Laboratories
Curated by ChEMBL
Assay Description
Inhibition of [125I]-buserelin binding to rat pituitary Gonadotropin-releasing hormone receptor, in the absence of bovine serum albumin (BSA)
Bioorg Med Chem Lett 11: 1723-6 (2001)
BindingDB Entry DOI: 10.7270/Q2KH0MK4
Gonadotropin-releasing hormone receptor
(Rattus norvegicus)
BDBM50101164
(CHEMBL295152 | N-{4-[4-(2-{2-(3,5-Dimethyl-phenyl)...)
Show SMILES CC1CCC(C)N1C(=O)C(C)(C)c1ccc2[nH]c(c(CCNCCCCc3ccc(NS(C)(=O)=O)cc3)c2c1)-c1cc(C)cc(C)c1
Show InChI InChI=1S/C39H52N4O3S/c1-26-22-27(2)24-31(23-26)37-34(19-21-40-20-9-8-10-30-13-16-33(17-14-30)42-47(7,45)46)35-25-32(15-18-36(35)41-37)39(5,6)38(44)43-28(3)11-12-29(43)4/h13-18,22-25,28-29,40-42H,8-12,19-21H2,1-7H3
n/an/a 65n/an/an/an/an/an/a
Merck Research Laboratories
Curated by ChEMBL
Assay Description
Inhibition GnRH-stimulated luteinizing hormone (LH) release from rat pituitary cells
Bioorg Med Chem Lett 11: 1723-6 (2001)
BindingDB Entry DOI: 10.7270/Q2KH0MK4