null
SMILES: CC1CCC(C)N1C(=O)c1ccc2[nH]c(c(CCNCCCCc3ccc(NS(C)(=O)=O)cc3)c2c1)-c1cc(C)cc(C)c1
InChI Key: InChIKey=UQMILXFLXOSGFZ-UHFFFAOYSA-N
Activity Spreadsheet -- Enzyme Inhibition Constant Data from BindingDB
Found 3 hits for monomerid = 50101165
Trg + Lig
Ki
nM
ΔG°
kcal/mole
IC50
nM
Kd
nM
EC50/IC50
nM
koff
s-1
kon
M-1s-1
pHTemp
°C
Gonadotropin-releasing hormone receptor
(Rattus norvegicus)
BDBM50101165
(CHEMBL239108 | N-[4-(4-{2-[2-(3,5-Dimethyl-phenyl)...)
Show SMILES CC1CCC(C)N1C(=O)c1ccc2[nH]c(c(CCNCCCCc3ccc(NS(C)(=O)=O)cc3)c2c1)-c1cc(C)cc(C)c1
Show InChI InChI=1S/C36H46N4O3S/c1-24-20-25(2)22-30(21-24)35-32(17-19-37-18-7-6-8-28-11-14-31(15-12-28)39-44(5,42)43)33-23-29(13-16-34(33)38-35)36(41)40-26(3)9-10-27(40)4/h11-16,20-23,26-27,37-39H,6-10,17-19H2,1-5H3
n/an/a 0.200n/an/an/an/an/an/a
Merck Research Laboratories
Curated by ChEMBL
Assay Description
Inhibition of [125I]-buserelin binding to rat pituitary Gonadotropin-releasing hormone receptor, in the presence of 0.1% bovine serum albumin.
Bioorg Med Chem Lett 11: 1723-6 (2001)
BindingDB Entry DOI: 10.7270/Q2KH0MK4
Gonadotropin-releasing hormone receptor
(Rattus norvegicus)
BDBM50101165
(CHEMBL239108 | N-[4-(4-{2-[2-(3,5-Dimethyl-phenyl)...)
Show SMILES CC1CCC(C)N1C(=O)c1ccc2[nH]c(c(CCNCCCCc3ccc(NS(C)(=O)=O)cc3)c2c1)-c1cc(C)cc(C)c1
Show InChI InChI=1S/C36H46N4O3S/c1-24-20-25(2)22-30(21-24)35-32(17-19-37-18-7-6-8-28-11-14-31(15-12-28)39-44(5,42)43)33-23-29(13-16-34(33)38-35)36(41)40-26(3)9-10-27(40)4/h11-16,20-23,26-27,37-39H,6-10,17-19H2,1-5H3
n/an/a 3n/an/an/an/an/an/a
Merck Research Laboratories
Curated by ChEMBL
Assay Description
Inhibition of [125I]-buserelin binding to rat pituitary Gonadotropin-releasing hormone receptor, in the absence of bovine serum albumin (BSA)
Bioorg Med Chem Lett 11: 1723-6 (2001)
BindingDB Entry DOI: 10.7270/Q2KH0MK4
Gonadotropin-releasing hormone receptor
(Rattus norvegicus)
BDBM50101165
(CHEMBL239108 | N-[4-(4-{2-[2-(3,5-Dimethyl-phenyl)...)
Show SMILES CC1CCC(C)N1C(=O)c1ccc2[nH]c(c(CCNCCCCc3ccc(NS(C)(=O)=O)cc3)c2c1)-c1cc(C)cc(C)c1
Show InChI InChI=1S/C36H46N4O3S/c1-24-20-25(2)22-30(21-24)35-32(17-19-37-18-7-6-8-28-11-14-31(15-12-28)39-44(5,42)43)33-23-29(13-16-34(33)38-35)36(41)40-26(3)9-10-27(40)4/h11-16,20-23,26-27,37-39H,6-10,17-19H2,1-5H3
n/an/a 95n/an/an/an/an/an/a
Merck Research Laboratories
Curated by ChEMBL
Assay Description
Inhibition GnRH-stimulated luteinizing hormone (LH) release from rat pituitary cells
Bioorg Med Chem Lett 11: 1723-6 (2001)
BindingDB Entry DOI: 10.7270/Q2KH0MK4