null
SMILES: CCOC(=O)C(C)(C)c1ccc2[nH]c(c(CCNCCCCc3ccc(NS(C)(=O)=O)cc3)c2c1)-c1cc(C)cc(C)c1
InChI Key: InChIKey=BCIRPBHKMMHSSH-UHFFFAOYSA-N
Activity Spreadsheet -- Enzyme Inhibition Constant Data from BindingDB
Found 3 hits for monomerid = 50101167
Trg + Lig
Ki
nM
ΔG°
kcal/mole
IC50
nM
Kd
nM
EC50/IC50
nM
koff
s-1
kon
M-1s-1
pHTemp
°C
Gonadotropin-releasing hormone receptor
(Rattus norvegicus)
BDBM50101167
(2-(2-(3,5-Dimethyl-phenyl)-3-{2-[4-(4-methanesulfo...)
Show SMILES CCOC(=O)C(C)(C)c1ccc2[nH]c(c(CCNCCCCc3ccc(NS(C)(=O)=O)cc3)c2c1)-c1cc(C)cc(C)c1
Show InChI InChI=1S/C35H45N3O4S/c1-7-42-34(39)35(4,5)28-13-16-32-31(23-28)30(33(37-32)27-21-24(2)20-25(3)22-27)17-19-36-18-9-8-10-26-11-14-29(15-12-26)38-43(6,40)41/h11-16,20-23,36-38H,7-10,17-19H2,1-6H3
n/an/a 3n/an/an/an/an/an/a
Merck Research Laboratories
Curated by ChEMBL
Assay Description
Inhibition of [125I]-buserelin binding to rat pituitary Gonadotropin-releasing hormone receptor, in the absence of bovine serum albumin (BSA)
Bioorg Med Chem Lett 11: 1723-6 (2001)
BindingDB Entry DOI: 10.7270/Q2KH0MK4
Gonadotropin-releasing hormone receptor
(Rattus norvegicus)
BDBM50101167
(2-(2-(3,5-Dimethyl-phenyl)-3-{2-[4-(4-methanesulfo...)
Show SMILES CCOC(=O)C(C)(C)c1ccc2[nH]c(c(CCNCCCCc3ccc(NS(C)(=O)=O)cc3)c2c1)-c1cc(C)cc(C)c1
Show InChI InChI=1S/C35H45N3O4S/c1-7-42-34(39)35(4,5)28-13-16-32-31(23-28)30(33(37-32)27-21-24(2)20-25(3)22-27)17-19-36-18-9-8-10-26-11-14-29(15-12-26)38-43(6,40)41/h11-16,20-23,36-38H,7-10,17-19H2,1-6H3
n/an/a 0.300n/an/an/an/an/an/a
Merck Research Laboratories
Curated by ChEMBL
Assay Description
Inhibition of [125I]-buserelin binding to rat pituitary Gonadotropin-releasing hormone receptor, in the presence of 0.1% bovine serum albumin.
Bioorg Med Chem Lett 11: 1723-6 (2001)
BindingDB Entry DOI: 10.7270/Q2KH0MK4
Gonadotropin-releasing hormone receptor
(Rattus norvegicus)
BDBM50101167
(2-(2-(3,5-Dimethyl-phenyl)-3-{2-[4-(4-methanesulfo...)
Show SMILES CCOC(=O)C(C)(C)c1ccc2[nH]c(c(CCNCCCCc3ccc(NS(C)(=O)=O)cc3)c2c1)-c1cc(C)cc(C)c1
Show InChI InChI=1S/C35H45N3O4S/c1-7-42-34(39)35(4,5)28-13-16-32-31(23-28)30(33(37-32)27-21-24(2)20-25(3)22-27)17-19-36-18-9-8-10-26-11-14-29(15-12-26)38-43(6,40)41/h11-16,20-23,36-38H,7-10,17-19H2,1-6H3
n/an/a 150n/an/an/an/an/an/a
Merck Research Laboratories
Curated by ChEMBL
Assay Description
Inhibition of trypsin in human mast cells
Bioorg Med Chem Lett 11: 1723-6 (2001)
BindingDB Entry DOI: 10.7270/Q2KH0MK4