null
SMILES: CCCCN(CCCC)C(=O)c1ccc2[nH]c(c(CCNCCCCc3cccnc3)c2c1)-c1cc(C)cc(C)c1
InChI Key: InChIKey=HKSACTHMCIPFRN-UHFFFAOYSA-N
Activity Spreadsheet -- Enzyme Inhibition Constant Data from BindingDB
Found 2 hits for monomerid = 50101234
Trg + Lig
Ki
nM
ΔG°
kcal/mole
IC50
nM
Kd
nM
EC50/IC50
nM
koff
s-1
kon
M-1s-1
pHTemp
°C
Gonadotropin-releasing hormone receptor
(Rattus norvegicus)
BDBM50101234
(2-(3,5-Dimethyl-phenyl)-3-[2-(4-pyridin-3-yl-butyl...)
Show SMILES CCCCN(CCCC)C(=O)c1ccc2[nH]c(c(CCNCCCCc3cccnc3)c2c1)-c1cc(C)cc(C)c1
Show InChI InChI=1S/C36H48N4O/c1-5-7-20-40(21-8-6-2)36(41)30-14-15-34-33(25-30)32(35(39-34)31-23-27(3)22-28(4)24-31)16-19-37-17-10-9-12-29-13-11-18-38-26-29/h11,13-15,18,22-26,37,39H,5-10,12,16-17,19-21H2,1-4H3
n/an/a 0.400n/an/an/an/an/an/a
Merck Research Laboratories
Curated by ChEMBL
Assay Description
Inhibition of [125I]-buserelin binding to rat Gonadotropin-releasing hormone receptor.
Bioorg Med Chem Lett 11: 1727-31 (2001)
BindingDB Entry DOI: 10.7270/Q2FQ9VW9
Gonadotropin-releasing hormone receptor
(Rattus norvegicus)
BDBM50101234
(2-(3,5-Dimethyl-phenyl)-3-[2-(4-pyridin-3-yl-butyl...)
Show SMILES CCCCN(CCCC)C(=O)c1ccc2[nH]c(c(CCNCCCCc3cccnc3)c2c1)-c1cc(C)cc(C)c1
Show InChI InChI=1S/C36H48N4O/c1-5-7-20-40(21-8-6-2)36(41)30-14-15-34-33(25-30)32(35(39-34)31-23-27(3)22-28(4)24-31)16-19-37-17-10-9-12-29-13-11-18-38-26-29/h11,13-15,18,22-26,37,39H,5-10,12,16-17,19-21H2,1-4H3
n/an/a 1.00E+3n/an/an/an/an/an/a
Merck Research Laboratories
Curated by ChEMBL
Assay Description
Inhibition of GnRH-stimulated luteinizing hormone (LH) release in rat pituitary cells
Bioorg Med Chem Lett 11: 1727-31 (2001)
BindingDB Entry DOI: 10.7270/Q2FQ9VW9