BDBM50101397 2-(2,6-Dichloro-phenyl)-3-(6-methyl-pyridin-2-yl)-thiazolidin-4-one::2-(2,6-dichlorophenyl)-3-(6-methyl-pyridin-2-yl)-4-thiazolidinone::2-(2,6-dichlorophenyl)-3-(6-methylpyridin-2-yl)thiazolidin-4-one::CHEMBL48427
SMILES: Cc1cccc(n1)N1C(SCC1=O)c1c(Cl)cccc1Cl
InChI Key: InChIKey=WMRUUYOOZLWLHY-UHFFFAOYSA-N
Data: 1 IC50
Activity Spreadsheet -- Enzyme Inhibition Constant Data from BindingDB
Found 1 hit for monomerid = 50101397
Trg + Lig
Ki
nM
ΔG°
kcal/mole
IC50
nM
Kd
nM
EC50/IC50
nM
koff
s-1
kon
M-1s-1
pHTemp
°C
Human immunodeficiency virus type 1 reverse transcriptase
(Human immunodeficiency virus 1)
BDBM50101397
(2-(2,6-Dichloro-phenyl)-3-(6-methyl-pyridin-2-yl)-...)
Show SMILES Cc1cccc(n1)N1C(SCC1=O)c1c(Cl)cccc1Cl
Show InChI InChI=1S/C15H12Cl2N2OS/c1-9-4-2-7-12(18-9)19-13(20)8-21-15(19)14-10(16)5-3-6-11(14)17/h2-7,15H,8H2,1H3
n/an/a 2.24E+3n/an/an/an/an/an/a
Università di Messina
Curated by ChEMBL
Assay Description
HIV-1 reverse transcriptase (RT) activity using Poly (rC)/oligo (dG) as template/primer and [3H]dGTP
J Med Chem 45: 5410-3 (2002)
BindingDB Entry DOI: 10.7270/Q2TT4Q9K