BDBM50101597 (3-Carboxy-2-tetradecyloxy-propyl)-trimethyl-ammonium::CHEMBL76417
SMILES: CCCCCCCCCCCCCCOC(CC([O-])=O)C[N+](C)(C)C
InChI Key: InChIKey=WSVJUZMWTWKVKZ-UHFFFAOYSA-N
Data: 1 IC50
Activity Spreadsheet -- Enzyme Inhibition Constant Data from BindingDB
Found 1 hit for monomerid = 50101597
Trg + Lig
Ki
nM
ΔG°
kcal/mole
IC50
nM
Kd
nM
EC50/IC50
nM
koff
s-1
kon
M-1s-1
pHTemp
°C
Carnitine palmitoyltransferase 1A
(Rattus norvegicus)
BDBM50101597
((3-Carboxy-2-tetradecyloxy-propyl)-trimethyl-ammon...)
Show SMILES CCCCCCCCCCCCCCOC(CC([O-])=O)C[N+](C)(C)C
Show InChI InChI=1S/C21H43NO3/c1-5-6-7-8-9-10-11-12-13-14-15-16-17-25-20(18-21(23)24)19-22(2,3)4/h20H,5-19H2,1-4H3
Reactome pathway
n/an/a 4.70E+4n/an/an/an/an/an/a
Sigma Tau Pharmaceutical Industries S.p.A.
Curated by ChEMBL
Assay Description
Inhibition of rat liver mitochondrial carnitine palmitoyltransferase 1 using [14C]-palmitoyl-CoA radioligand
J Med Chem 44: 2383-6 (2001)
BindingDB Entry DOI: 10.7270/Q2930SG7