BDBM50101601 (3-Carboxy-2-octyloxy-propyl)-trimethyl-ammonium::CHEMBL80285
SMILES: CCCCCCCCOC(CC([O-])=O)C[N+](C)(C)C
InChI Key: InChIKey=UOJBHVKQUQDVCF-UHFFFAOYSA-N
Data: 1 IC50
Activity Spreadsheet -- Enzyme Inhibition Constant Data from BindingDB
Found 1 hit for monomerid = 50101601
Trg + Lig
Ki
nM
ΔG°
kcal/mole
IC50
nM
Kd
nM
EC50/IC50
nM
koff
s-1
kon
M-1s-1
pHTemp
°C
Carnitine palmitoyltransferase 1A
(Rattus norvegicus)
BDBM50101601
((3-Carboxy-2-octyloxy-propyl)-trimethyl-ammonium |...)
Show SMILES CCCCCCCCOC(CC([O-])=O)C[N+](C)(C)C
Show InChI InChI=1S/C15H31NO3/c1-5-6-7-8-9-10-11-19-14(12-15(17)18)13-16(2,3)4/h14H,5-13H2,1-4H3
Reactome pathway
n/an/a>3.00E+5n/an/an/an/an/an/a
Sigma Tau Pharmaceutical Industries S.p.A.
Curated by ChEMBL
Assay Description
Inhibition of rat liver mitochondrial carnitine palmitoyltransferase 1 using [14C]-palmitoyl-CoA radioligand
J Med Chem 44: 2383-6 (2001)
BindingDB Entry DOI: 10.7270/Q2930SG7