BDBM50101629 CHEMBL309307::N-{2-[2-Amino-3-(4-hydroxy-2,6-dimethyl-phenyl)-propionyl]-1,2,3,4-tetrahydro-isoquinolin-3-ylmethyl}-benzamide
SMILES: Cc1cc(O)cc(C)c1C[C@H](N)C(=O)N1Cc2ccccc2C[C@H]1CNC(=O)c1ccccc1
InChI Key: InChIKey=VMTCEUXGAGRBNX-OZXSUGGESA-N
Data: 3 IC50  1 EC50
Activity Spreadsheet -- Enzyme Inhibition Constant Data from BindingDB
Found 4 hits for monomerid = 50101629
Trg + Lig
Ki
nM
ΔG°
kcal/mole
IC50
nM
Kd
nM
EC50/IC50
nM
koff
s-1
kon
M-1s-1
pHTemp
°C
Delta-type opioid receptor
(Homo sapiens (Human))
BDBM50101629
(CHEMBL309307 | N-{2-[2-Amino-3-(4-hydroxy-2,6-dime...)
Show SMILES Cc1cc(O)cc(C)c1C[C@H](N)C(=O)N1Cc2ccccc2C[C@H]1CNC(=O)c1ccccc1
Show InChI InChI=1S/C28H31N3O3/c1-18-12-24(32)13-19(2)25(18)15-26(29)28(34)31-17-22-11-7-6-10-21(22)14-23(31)16-30-27(33)20-8-4-3-5-9-20/h3-13,23,26,32H,14-17,29H2,1-2H3,(H,30,33)/t23-,26-/m0/s1
Reactome pathway
n/an/a 0.240n/an/an/an/an/an/a
AstraZeneca R&D Montreal
Curated by ChEMBL
Assay Description
Binding affinity at cloned human delta-opioid receptor
J Med Chem 44: 2387-90 (2001)
BindingDB Entry DOI: 10.7270/Q25B01RW
Kappa-type opioid receptor
(Homo sapiens (Human))
BDBM50101629
(CHEMBL309307 | N-{2-[2-Amino-3-(4-hydroxy-2,6-dime...)
Show SMILES Cc1cc(O)cc(C)c1C[C@H](N)C(=O)N1Cc2ccccc2C[C@H]1CNC(=O)c1ccccc1
Show InChI InChI=1S/C28H31N3O3/c1-18-12-24(32)13-19(2)25(18)15-26(29)28(34)31-17-22-11-7-6-10-21(22)14-23(31)16-30-27(33)20-8-4-3-5-9-20/h3-13,23,26,32H,14-17,29H2,1-2H3,(H,30,33)/t23-,26-/m0/s1
Reactome pathway
n/an/a 307n/an/an/an/an/an/a
AstraZeneca R&D Montreal
Curated by ChEMBL
Assay Description
Agonist potency using GTP-gamma [35S]- binding assay for opioid receptor kappa 1
J Med Chem 44: 2387-90 (2001)
BindingDB Entry DOI: 10.7270/Q25B01RW
Mu-type opioid receptor
(Homo sapiens (Human))
BDBM50101629
(CHEMBL309307 | N-{2-[2-Amino-3-(4-hydroxy-2,6-dime...)
Show SMILES Cc1cc(O)cc(C)c1C[C@H](N)C(=O)N1Cc2ccccc2C[C@H]1CNC(=O)c1ccccc1
Show InChI InChI=1S/C28H31N3O3/c1-18-12-24(32)13-19(2)25(18)15-26(29)28(34)31-17-22-11-7-6-10-21(22)14-23(31)16-30-27(33)20-8-4-3-5-9-20/h3-13,23,26,32H,14-17,29H2,1-2H3,(H,30,33)/t23-,26-/m0/s1
NCI pathway
Reactome pathway
n/an/a 0.980n/an/an/an/an/an/a
AstraZeneca R&D Montreal
Curated by ChEMBL
Assay Description
Agonist potency using GTP-gamma [35S]- binding assay for mu-opioid receptor
J Med Chem 44: 2387-90 (2001)
BindingDB Entry DOI: 10.7270/Q25B01RW
Mu-type opioid receptor
(Homo sapiens (Human))
BDBM50101629
(CHEMBL309307 | N-{2-[2-Amino-3-(4-hydroxy-2,6-dime...)
Show SMILES Cc1cc(O)cc(C)c1C[C@H](N)C(=O)N1Cc2ccccc2C[C@H]1CNC(=O)c1ccccc1
Show InChI InChI=1S/C28H31N3O3/c1-18-12-24(32)13-19(2)25(18)15-26(29)28(34)31-17-22-11-7-6-10-21(22)14-23(31)16-30-27(33)20-8-4-3-5-9-20/h3-13,23,26,32H,14-17,29H2,1-2H3,(H,30,33)/t23-,26-/m0/s1
NCI pathway
Reactome pathway
n/an/an/an/a 109n/an/an/an/a
AstraZeneca R&D Montreal
Curated by ChEMBL
Assay Description
Agonist potency using GTP-gamma [35S]- binding assay for mu-opioid receptor
J Med Chem 44: 2387-90 (2001)
BindingDB Entry DOI: 10.7270/Q25B01RW