BDBM50101743 CHEMBL3394894
SMILES: COc1cc(\C=N\NC(=O)c2ccc(NC(=O)c3ccccc3)cc2)cc(Br)c1O
InChI Key: InChIKey=VLMHBNNOEWUVNP-ZMOGYAJESA-N
Data: 1 IC50
Activity Spreadsheet -- Enzyme Inhibition Constant Data from BindingDB
Found 1 hit for monomerid = 50101743
Trg + Lig
Ki
nM
ΔG°
kcal/mole
IC50
nM
Kd
nM
EC50/IC50
nM
koff
s-1
kon
M-1s-1
pHTemp
°C
Histone chaperone ASF1A
(Homo sapiens (Human))
BDBM50101743
(CHEMBL3394894)
Show SMILES COc1cc(\C=N\NC(=O)c2ccc(NC(=O)c3ccccc3)cc2)cc(Br)c1O
Show InChI InChI=1S/C22H18BrN3O4/c1-30-19-12-14(11-18(23)20(19)27)13-24-26-22(29)16-7-9-17(10-8-16)25-21(28)15-5-3-2-4-6-15/h2-13,27H,1H3,(H,25,28)(H,26,29)/b24-13+
n/an/a 1.20E+4n/an/an/an/an/an/a
Colorado State University
Curated by ChEMBL
Assay Description
Inhibition of His-tagged human Asf1a binding with H3/H4 assessed as fluorescence intensity after 30 mins by ALPHA assay
Bioorg Med Chem Lett 25: 963-8 (2015)
Article DOI: 10.1016/j.bmcl.2014.11.067
BindingDB Entry DOI: 10.7270/Q2VM4F0G