BDBM50101965 CHEMBL3436049
SMILES: CC(C)OC(=O)C1=C(C)NC(C)=C(C1c1cccc2nonc12)C(=O)OCCCCCCCCCC[N+](C)(C)C
InChI Key: InChIKey=MPZILEAILJCTEU-UHFFFAOYSA-O
Data: 1 IC50
Activity Spreadsheet -- Enzyme Inhibition Constant Data from BindingDB
Found 1 hit for monomerid = 50101965
Trg + Lig
Ki
nM
ΔG°
kcal/mole
IC50
nM
Kd
nM
EC50/IC50
nM
koff
s-1
kon
M-1s-1
pHTemp
°C
Calcium channel (Type L)
(Homo sapiens (Human))
BDBM50101965
(CHEMBL3436049)
Show SMILES CC(C)OC(=O)C1=C(C)NC(C)=C(C1c1cccc2nonc12)C(=O)OCCCCCCCCCC[N+](C)(C)C |c:6,11|
Show InChI InChI=1S/C31H46N4O5/c1-21(2)39-31(37)27-23(4)32-22(3)26(28(27)24-17-16-18-25-29(24)34-40-33-25)30(36)38-20-15-13-11-9-8-10-12-14-19-35(5,6)7/h16-18,21,28H,8-15,19-20H2,1-7H3/p+1
n/an/a 70n/an/an/an/an/an/a
Jagiellonian University
Curated by ChEMBL
Assay Description
Inhibition of L-type calcium channel measured using 2-electrode voltage-clamp in Chinese hamster ovary cells heterologically expressing alpha-1C subu...
J Appl Toxicol 32: 858-66 (2012)
Article DOI: 10.1002/jat.2784
BindingDB Entry DOI: 10.7270/Q2D79D5C