BDBM50101978 CHEMBL3398160
SMILES: COC(=O)c1ccccc1NS(=O)(=O)c1ccc(OC(=O)C(C)(C)C(F)(F)F)cc1
InChI Key: InChIKey=VFYZSCJFFKGKCS-UHFFFAOYSA-N
Data: 3 IC50
Activity Spreadsheet -- Enzyme Inhibition Constant Data from BindingDB
Found 3 hits for monomerid = 50101978
Trg + Lig
Ki
nM
ΔG°
kcal/mole
IC50
nM
Kd
nM
EC50/IC50
nM
koff
s-1
kon
M-1s-1
pHTemp
°C
Cathepsin G
(Homo sapiens (Human))
BDBM50101978
(CHEMBL3398160)
Show SMILES COC(=O)c1ccccc1NS(=O)(=O)c1ccc(OC(=O)C(C)(C)C(F)(F)F)cc1
Show InChI InChI=1S/C19H18F3NO6S/c1-18(2,19(20,21)22)17(25)29-12-8-10-13(11-9-12)30(26,27)23-15-7-5-4-6-14(15)16(24)28-3/h4-11,23H,1-3H3
NCI pathway
Reactome pathway
n/an/a>1n/an/an/an/an/an/a
Chang Gung University
Curated by ChEMBL
Assay Description
Inhibition of human cathepsin G using N-succinyl-Ala-Ala-Pro-Phe-p-nitroanilide as substrate measured for 180 mins by spectrophotometry
Bioorg Med Chem 23: 1123-34 (2015)
Article DOI: 10.1016/j.bmc.2014.12.056
BindingDB Entry DOI: 10.7270/Q2CJ8G5M
Leukocyte elastase
(Homo sapiens (Human))
BDBM50101978
(CHEMBL3398160)
Show SMILES COC(=O)c1ccccc1NS(=O)(=O)c1ccc(OC(=O)C(C)(C)C(F)(F)F)cc1
Show InChI InChI=1S/C19H18F3NO6S/c1-18(2,19(20,21)22)17(25)29-12-8-10-13(11-9-12)30(26,27)23-15-7-5-4-6-14(15)16(24)28-3/h4-11,23H,1-3H3
Reactome pathway
n/an/a 369n/an/an/an/an/an/a
Chang Gung University
Curated by ChEMBL
Assay Description
Inhibition of human neutrophil elastase measured for 30 mins by spectrophotometry
Bioorg Med Chem 23: 1123-34 (2015)
Article DOI: 10.1016/j.bmc.2014.12.056
BindingDB Entry DOI: 10.7270/Q2CJ8G5M
Leukocyte proteinase 3
(Homo sapiens (Human))
BDBM50101978
(CHEMBL3398160)
Show SMILES COC(=O)c1ccccc1NS(=O)(=O)c1ccc(OC(=O)C(C)(C)C(F)(F)F)cc1
Show InChI InChI=1S/C19H18F3NO6S/c1-18(2,19(20,21)22)17(25)29-12-8-10-13(11-9-12)30(26,27)23-15-7-5-4-6-14(15)16(24)28-3/h4-11,23H,1-3H3
NCI pathway
Reactome pathway
n/an/a 494n/an/an/an/an/an/a
Chang Gung University
Curated by ChEMBL
Assay Description
Inhibition of Pr3 (unknown origin) using t-butyloxycarbonyl-Ala-Ala-Nva-thiobenzyl ester as substrate measured for 180 mins by spectrophotometry
Bioorg Med Chem 23: 1123-34 (2015)
Article DOI: 10.1016/j.bmc.2014.12.056
BindingDB Entry DOI: 10.7270/Q2CJ8G5M