BDBM50101981 CHEMBL3398161
SMILES: COC(=O)c1ccccc1NS(=O)(=O)c1ccc(NC(=O)C(C)(C)C)cc1
InChI Key: InChIKey=OSFLKQQQDBTMGT-UHFFFAOYSA-N
Data: 3 IC50
Activity Spreadsheet -- Enzyme Inhibition Constant Data from BindingDB
Found 3 hits for monomerid = 50101981
Trg + Lig
Ki
nM
ΔG°
kcal/mole
IC50
nM
Kd
nM
EC50/IC50
nM
koff
s-1
kon
M-1s-1
pHTemp
°C
Cathepsin G
(Homo sapiens (Human))
BDBM50101981
(CHEMBL3398161)
Show SMILES COC(=O)c1ccccc1NS(=O)(=O)c1ccc(NC(=O)C(C)(C)C)cc1
Show InChI InChI=1S/C19H22N2O5S/c1-19(2,3)18(23)20-13-9-11-14(12-10-13)27(24,25)21-16-8-6-5-7-15(16)17(22)26-4/h5-12,21H,1-4H3,(H,20,23)
NCI pathway
Reactome pathway
n/an/a>1n/an/an/an/an/an/a
Chang Gung University
Curated by ChEMBL
Assay Description
Inhibition of human cathepsin G using N-succinyl-Ala-Ala-Pro-Phe-p-nitroanilide as substrate measured for 180 mins by spectrophotometry
Bioorg Med Chem 23: 1123-34 (2015)
Article DOI: 10.1016/j.bmc.2014.12.056
BindingDB Entry DOI: 10.7270/Q2CJ8G5M
Leukocyte elastase
(Homo sapiens (Human))
BDBM50101981
(CHEMBL3398161)
Show SMILES COC(=O)c1ccccc1NS(=O)(=O)c1ccc(NC(=O)C(C)(C)C)cc1
Show InChI InChI=1S/C19H22N2O5S/c1-19(2,3)18(23)20-13-9-11-14(12-10-13)27(24,25)21-16-8-6-5-7-15(16)17(22)26-4/h5-12,21H,1-4H3,(H,20,23)
Reactome pathway
n/an/a>1n/an/an/an/an/an/a
Chang Gung University
Curated by ChEMBL
Assay Description
Inhibition of human neutrophil elastase measured for 30 mins by spectrophotometry
Bioorg Med Chem 23: 1123-34 (2015)
Article DOI: 10.1016/j.bmc.2014.12.056
BindingDB Entry DOI: 10.7270/Q2CJ8G5M
Leukocyte proteinase 3
(Homo sapiens (Human))
BDBM50101981
(CHEMBL3398161)
Show SMILES COC(=O)c1ccccc1NS(=O)(=O)c1ccc(NC(=O)C(C)(C)C)cc1
Show InChI InChI=1S/C19H22N2O5S/c1-19(2,3)18(23)20-13-9-11-14(12-10-13)27(24,25)21-16-8-6-5-7-15(16)17(22)26-4/h5-12,21H,1-4H3,(H,20,23)
NCI pathway
Reactome pathway
n/an/a>1n/an/an/an/an/an/a
Chang Gung University
Curated by ChEMBL
Assay Description
Inhibition of Pr3 (unknown origin) using t-butyloxycarbonyl-Ala-Ala-Nva-thiobenzyl ester as substrate measured for 180 mins by spectrophotometry
Bioorg Med Chem 23: 1123-34 (2015)
Article DOI: 10.1016/j.bmc.2014.12.056
BindingDB Entry DOI: 10.7270/Q2CJ8G5M