null
SMILES: [O-][n+]1cc(ccc1Cl)C(=O)Nc1ccc(F)cc1
InChI Key: InChIKey=MEWOMDUCJFJDGL-UHFFFAOYSA-N
Activity Spreadsheet -- Enzyme Inhibition Constant Data from BindingDB
Found 1 hit for monomerid = 50102221
Trg + Lig
Ki
nM
ΔG°
kcal/mole
IC50
nM
Kd
nM
EC50/IC50
nM
koff
s-1
kon
M-1s-1
pHTemp
°C
C-X-C chemokine receptor type 2
(Homo sapiens (Human))
BDBM50102221
(6-Chloro-N-(4-fluoro-phenyl)-1-oxy-nicotinamide | ...)
Show SMILES [O-][n+]1cc(ccc1Cl)C(=O)Nc1ccc(F)cc1
Show InChI InChI=1S/C12H8ClFN2O2/c13-11-6-1-8(7-16(11)18)12(17)15-10-4-2-9(14)3-5-10/h1-7H,(H,15,17)
Reactome pathway
n/an/a 1.00E+3n/an/an/an/an/an/a
Celltech R&D
Curated by ChEMBL
Assay Description
Evaluated using an SPA assay with recombinant human [125I]-IL-8 and membranes preparedfrom Sf9 cells expressing human CXCR2
Bioorg Med Chem Lett 11: 1951-4 (2001)
BindingDB Entry DOI: 10.7270/Q2TX3DN0