null
SMILES: [O-][n+]1cc(ccc1S(=O)(=O)C1CCCC1)C(=O)Nc1ccc(F)cc1
InChI Key: InChIKey=SHVNZDOZJFWLCW-UHFFFAOYSA-N
Activity Spreadsheet -- Enzyme Inhibition Constant Data from BindingDB
Found 1 hit for monomerid = 50102230
Trg + Lig
Ki
nM
ΔG°
kcal/mole
IC50
nM
Kd
nM
EC50/IC50
nM
koff
s-1
kon
M-1s-1
pHTemp
°C
C-X-C chemokine receptor type 2
(Homo sapiens (Human))
BDBM50102230
(6-Cyclopentanesulfonyl-N-(4-fluoro-phenyl)-1-oxy-n...)
Show SMILES [O-][n+]1cc(ccc1S(=O)(=O)C1CCCC1)C(=O)Nc1ccc(F)cc1
Show InChI InChI=1S/C17H17FN2O4S/c18-13-6-8-14(9-7-13)19-17(21)12-5-10-16(20(22)11-12)25(23,24)15-3-1-2-4-15/h5-11,15H,1-4H2,(H,19,21)
Reactome pathway
n/an/a 460n/an/an/an/an/an/a
Celltech R&D
Curated by ChEMBL
Assay Description
Evaluated using an SPA assay with recombinant human [125I]-IL-8 and membranes preparedfrom Sf9 cells expressing human CXCR2
Bioorg Med Chem Lett 11: 1951-4 (2001)
BindingDB Entry DOI: 10.7270/Q2TX3DN0