BDBM50102260 2-(2-Amino-4-carboxy-butyrylamino)-pentanedioic acid::CHEMBL318315::Glu(Glu)::Glu-Glu
SMILES: N[C@@H](CCC(O)=O)C(=O)N[C@@H](CCC(O)=O)C(O)=O
InChI Key: InChIKey=KOSRFJWDECSPRO-WDSKDSINSA-N
Data: 2 IC50  1 EC50
Activity Spreadsheet -- Enzyme Inhibition Constant Data from BindingDB
Found 3 hits for monomerid = 50102260
Trg + Lig
Ki
nM
ΔG°
kcal/mole
IC50
nM
Kd
nM
EC50/IC50
nM
koff
s-1
kon
M-1s-1
pHTemp
°C
Glutamate carboxypeptidase II
(Rattus norvegicus)
BDBM50102260
(2-(2-Amino-4-carboxy-butyrylamino)-pentanedioic ac...)
Show SMILES N[C@@H](CCC(O)=O)C(=O)N[C@@H](CCC(O)=O)C(O)=O
Show InChI InChI=1S/C10H16N2O7/c11-5(1-3-7(13)14)9(17)12-6(10(18)19)2-4-8(15)16/h5-6H,1-4,11H2,(H,12,17)(H,13,14)(H,15,16)(H,18,19)/t5-,6-/m0/s1
n/an/a 750n/an/an/an/an/an/a
TBA
Curated by ChEMBL
Assay Description
Inhibitory activity of the compound against expressed rat Glutamate carboxypeptidase II, using a substrate concentration of 5 microM
J Med Chem 44: 298-301 (2001)
BindingDB Entry DOI: 10.7270/Q2KD1X7Q
Oligopeptide transporter small intestine isoform
(Homo sapiens (Human))
BDBM50102260
(2-(2-Amino-4-carboxy-butyrylamino)-pentanedioic ac...)
Show SMILES N[C@@H](CCC(O)=O)C(=O)N[C@@H](CCC(O)=O)C(O)=O
Show InChI InChI=1S/C10H16N2O7/c11-5(1-3-7(13)14)9(17)12-6(10(18)19)2-4-8(15)16/h5-6H,1-4,11H2,(H,12,17)(H,13,14)(H,15,16)(H,18,19)/t5-,6-/m0/s1
Reactome pathway
n/an/an/an/a 1.00E+6n/an/an/an/a
Pharmaceutical Research Institute
Curated by ChEMBL
Assay Description
Activation of human PEPT1 expressed in MDCK cells
J Med Chem 49: 3636-44 (2006)
Article DOI: 10.1021/jm0511029
BindingDB Entry DOI: 10.7270/Q2P55P9R
Oligopeptide transporter small intestine isoform
(Homo sapiens (Human))
BDBM50102260
(2-(2-Amino-4-carboxy-butyrylamino)-pentanedioic ac...)
Show SMILES N[C@@H](CCC(O)=O)C(=O)N[C@@H](CCC(O)=O)C(O)=O
Show InChI InChI=1S/C10H16N2O7/c11-5(1-3-7(13)14)9(17)12-6(10(18)19)2-4-8(15)16/h5-6H,1-4,11H2,(H,12,17)(H,13,14)(H,15,16)(H,18,19)/t5-,6-/m0/s1
Reactome pathway
n/an/a 6.20E+5n/an/an/an/an/an/a
Pharmaceutical Research Institute
Curated by ChEMBL
Assay Description
Binding affinity to human PEPT1 assessed as inhibition of [14C]Gly-Sar uptake in MDCK cells
J Med Chem 49: 3636-44 (2006)
Article DOI: 10.1021/jm0511029
BindingDB Entry DOI: 10.7270/Q2P55P9R