BDBM50102798 CHEMBL3359075
SMILES: COc1cccc(CNC(=O)c2nc3cccc(Oc4ccccc4)c3c(=O)[nH]2)c1
InChI Key: InChIKey=YYTBKOFXYKJOTN-UHFFFAOYSA-N
Data: 1 IC50
Activity Spreadsheet -- Enzyme Inhibition Constant Data from BindingDB
Found 1 hit for monomerid = 50102798
Trg + Lig
Ki
nM
ΔG°
kcal/mole
IC50
nM
Kd
nM
EC50/IC50
nM
koff
s-1
kon
M-1s-1
pHTemp
°C
Collagenase 3
(Homo sapiens (Human))
BDBM50102798
(CHEMBL3359075)
Show SMILES COc1cccc(CNC(=O)c2nc3cccc(Oc4ccccc4)c3c(=O)[nH]2)c1
Show InChI InChI=1S/C23H19N3O4/c1-29-17-10-5-7-15(13-17)14-24-23(28)21-25-18-11-6-12-19(20(18)22(27)26-21)30-16-8-3-2-4-9-16/h2-13H,14H2,1H3,(H,24,28)(H,25,26,27)
NCI pathway
Reactome pathway
n/an/a 0.530n/an/an/an/an/an/a
Takeda Pharmaceutical Company Limited
Curated by ChEMBL
Assay Description
Inhibition of human recombinant MMP13 using Cy3-PLGLK(Cy5Q)AR-NH2 as substrate after 40 mins by spectrofluorimetry
J Med Chem 57: 8886-902 (2014)
Article DOI: 10.1021/jm500981k
BindingDB Entry DOI: 10.7270/Q28P628P