BDBM50102801 CHEMBL3359072
SMILES: COc1cccc(CNC(=O)c2nc3cccc(OC)c3c(=O)[nH]2)c1
InChI Key: InChIKey=DMYYEEBDCYKOBI-UHFFFAOYSA-N
Data: 1 IC50
Activity Spreadsheet -- Enzyme Inhibition Constant Data from BindingDB
Found 1 hit for monomerid = 50102801
Trg + Lig
Ki
nM
ΔG°
kcal/mole
IC50
nM
Kd
nM
EC50/IC50
nM
koff
s-1
kon
M-1s-1
pHTemp
°C
Collagenase 3
(Homo sapiens (Human))
BDBM50102801
(CHEMBL3359072)
Show SMILES COc1cccc(CNC(=O)c2nc3cccc(OC)c3c(=O)[nH]2)c1
Show InChI InChI=1S/C18H17N3O4/c1-24-12-6-3-5-11(9-12)10-19-18(23)16-20-13-7-4-8-14(25-2)15(13)17(22)21-16/h3-9H,10H2,1-2H3,(H,19,23)(H,20,21,22)
NCI pathway
Reactome pathway
n/an/a 25n/an/an/an/an/an/a
Takeda Pharmaceutical Company Limited
Curated by ChEMBL
Assay Description
Inhibition of human recombinant MMP13 using Cy3-PLGLK(Cy5Q)AR-NH2 as substrate after 40 mins by spectrofluorimetry
J Med Chem 57: 8886-902 (2014)
Article DOI: 10.1021/jm500981k
BindingDB Entry DOI: 10.7270/Q28P628P