BDBM50102810 CHEMBL3359064
SMILES: COc1cccc(CNC(=O)c2nc3ccc(OCc4ccccc4)cc3c(=O)[nH]2)c1
InChI Key: InChIKey=MSWSZPSKFBASHC-UHFFFAOYSA-N
Data: 1 IC50
Activity Spreadsheet -- Enzyme Inhibition Constant Data from BindingDB
Found 1 hit for monomerid = 50102810
Trg + Lig
Ki
nM
ΔG°
kcal/mole
IC50
nM
Kd
nM
EC50/IC50
nM
koff
s-1
kon
M-1s-1
pHTemp
°C
Collagenase 3
(Homo sapiens (Human))
BDBM50102810
(CHEMBL3359064)
Show SMILES COc1cccc(CNC(=O)c2nc3ccc(OCc4ccccc4)cc3c(=O)[nH]2)c1
Show InChI InChI=1S/C24H21N3O4/c1-30-18-9-5-8-17(12-18)14-25-24(29)22-26-21-11-10-19(13-20(21)23(28)27-22)31-15-16-6-3-2-4-7-16/h2-13H,14-15H2,1H3,(H,25,29)(H,26,27,28)
NCI pathway
Reactome pathway
n/an/a 110n/an/an/an/an/an/a
Takeda Pharmaceutical Company Limited
Curated by ChEMBL
Assay Description
Inhibition of human recombinant MMP13 using Cy3-PLGLK(Cy5Q)AR-NH2 as substrate after 40 mins by spectrofluorimetry
J Med Chem 57: 8886-902 (2014)
Article DOI: 10.1021/jm500981k
BindingDB Entry DOI: 10.7270/Q28P628P