BDBM50102844 CHEMBL3329641
SMILES: Cn1c2nccc(N3CC[C@@H](N)C3)c2n(Cc2ccccc2C#N)c1=O
InChI Key: InChIKey=BOAKHZLGSZWTBV-OAHLLOKOSA-N
Data: 3 IC50
Activity Spreadsheet -- Enzyme Inhibition Constant Data from BindingDB
Found 3 hits for monomerid = 50102844
Trg + Lig
Ki
nM
ΔG°
kcal/mole
IC50
nM
Kd
nM
EC50/IC50
nM
koff
s-1
kon
M-1s-1
pHTemp
°C
Dipeptidyl peptidase 9
(Homo sapiens (Human))
BDBM50102844
(CHEMBL3329641)
Show SMILES Cn1c2nccc(N3CC[C@@H](N)C3)c2n(Cc2ccccc2C#N)c1=O |r|
Show InChI InChI=1S/C19H20N6O/c1-23-18-17(16(6-8-22-18)24-9-7-15(21)12-24)25(19(23)26)11-14-5-3-2-4-13(14)10-20/h2-6,8,15H,7,9,11-12,21H2,1H3/t15-/m1/s1
n/an/a>1.00E+5n/an/an/an/an/an/a
XuanZhu Pharma
Curated by ChEMBL
Assay Description
Inhibition of human recombinant DPP9 pre-incubated with compound for 15 mins before substrate addition by luminescence assay
ACS Med Chem Lett 5: 921-6 (2014)
Article DOI: 10.1021/ml5001905
BindingDB Entry DOI: 10.7270/Q2N29ZQM
Dipeptidyl peptidase VIII
(Homo sapiens (Human))
BDBM50102844
(CHEMBL3329641)
Show SMILES Cn1c2nccc(N3CC[C@@H](N)C3)c2n(Cc2ccccc2C#N)c1=O |r|
Show InChI InChI=1S/C19H20N6O/c1-23-18-17(16(6-8-22-18)24-9-7-15(21)12-24)25(19(23)26)11-14-5-3-2-4-13(14)10-20/h2-6,8,15H,7,9,11-12,21H2,1H3/t15-/m1/s1
n/an/a>1.00E+5n/an/an/an/an/an/a
XuanZhu Pharma
Curated by ChEMBL
Assay Description
Inhibition of human recombinant DPP8 pre-incubated with compound for 15 mins before substrate addition by luminescence assay
ACS Med Chem Lett 5: 921-6 (2014)
Article DOI: 10.1021/ml5001905
BindingDB Entry DOI: 10.7270/Q2N29ZQM
Dipeptidyl peptidase 4
(Homo sapiens (Human))
BDBM50102844
(CHEMBL3329641)
Show SMILES Cn1c2nccc(N3CC[C@@H](N)C3)c2n(Cc2ccccc2C#N)c1=O |r|
Show InChI InChI=1S/C19H20N6O/c1-23-18-17(16(6-8-22-18)24-9-7-15(21)12-24)25(19(23)26)11-14-5-3-2-4-13(14)10-20/h2-6,8,15H,7,9,11-12,21H2,1H3/t15-/m1/s1
Reactome pathway
n/an/a 22n/an/an/an/an/an/a
XuanZhu Pharma
Curated by ChEMBL
Assay Description
Inhibition of human recombinant DPP4 pre-incubated with compound for 15 mins before substrate addition by luminescence assay
ACS Med Chem Lett 5: 921-6 (2014)
Article DOI: 10.1021/ml5001905
BindingDB Entry DOI: 10.7270/Q2N29ZQM