BDBM50102856 CHEMBL3329626
SMILES: N[C@@H]1CCCN(C1)c1ccnc2[nH]c(=O)n(Cc3ccccc3C#N)c12
InChI Key:
Data: 3 IC50
Activity Spreadsheet -- Enzyme Inhibition Constant Data from BindingDB
Found 3 hits for monomerid = 50102856
Trg + Lig
Ki
nM
ΔG°
kcal/mole
IC50
nM
Kd
nM
EC50/IC50
nM
koff
s-1
kon
M-1s-1
pHTemp
°C
Dipeptidyl peptidase 4
(Homo sapiens (Human))
BDBM50102856
(CHEMBL3329626)
Show SMILES N[C@@H]1CCCN(C1)c1ccnc2[nH]c(=O)n(Cc3ccccc3C#N)c12 |r|
Reactome pathway
n/an/a 45n/an/an/an/an/an/a
XuanZhu Pharma
Curated by ChEMBL
Assay Description
Inhibition of human recombinant DPP4 pre-incubated with compound for 15 mins before substrate addition by luminescence assay
ACS Med Chem Lett 5: 921-6 (2014)
Article DOI: 10.1021/ml5001905
BindingDB Entry DOI: 10.7270/Q2N29ZQM
Dipeptidyl peptidase 9
(Homo sapiens (Human))
BDBM50102856
(CHEMBL3329626)
Show SMILES N[C@@H]1CCCN(C1)c1ccnc2[nH]c(=O)n(Cc3ccccc3C#N)c12 |r|
n/an/a>1.00E+5n/an/an/an/an/an/a
XuanZhu Pharma
Curated by ChEMBL
Assay Description
Inhibition of human recombinant DPP9 pre-incubated with compound for 15 mins before substrate addition by luminescence assay
ACS Med Chem Lett 5: 921-6 (2014)
Article DOI: 10.1021/ml5001905
BindingDB Entry DOI: 10.7270/Q2N29ZQM
Dipeptidyl peptidase VIII
(Homo sapiens (Human))
BDBM50102856
(CHEMBL3329626)
Show SMILES N[C@@H]1CCCN(C1)c1ccnc2[nH]c(=O)n(Cc3ccccc3C#N)c12 |r|
n/an/a>1.00E+5n/an/an/an/an/an/a
XuanZhu Pharma
Curated by ChEMBL
Assay Description
Inhibition of human recombinant DPP8 pre-incubated with compound for 15 mins before substrate addition by luminescence assay
ACS Med Chem Lett 5: 921-6 (2014)
Article DOI: 10.1021/ml5001905
BindingDB Entry DOI: 10.7270/Q2N29ZQM