BDBM50103504 CHEBI:9352::Clinoril::SULINDAC::Sulindac
SMILES: C[S+]([O-])c1ccc(\C=C2\C(C)=C(CC(O)=O)c3cc(F)ccc23)cc1
InChI Key: InChIKey=MLKXDPUZXIRXEP-MFOYZWKCSA-N
Data: 1 KI  11 IC50  1 Kd
Activity Spreadsheet -- Enzyme Inhibition Constant Data from BindingDB
Found 13 hits for monomerid = 50103504
Trg + Lig
Ki
nM
ΔG°
kcal/mole
IC50
nM
Kd
nM
EC50/IC50
nM
koff
s-1
kon
M-1s-1
pHTemp
°C
Serum albumin
(Homo sapiens (Human))
BDBM50103504
(CHEBI:9352 | Clinoril | SULINDAC | Sulindac)
Show SMILES C[S+]([O-])c1ccc(\C=C2\C(C)=C(CC(O)=O)c3cc(F)ccc23)cc1 |t:10|
Show InChI InChI=1S/C20H17FO3S/c1-12-17(9-13-3-6-15(7-4-13)25(2)24)16-8-5-14(21)10-19(16)18(12)11-20(22)23/h3-10H,11H2,1-2H3,(H,22,23)/b17-9-
NCI pathway
Reactome pathway
2.63E+13n/an/an/an/an/an/an/an/a
Molecular Discovery Ltd.
Curated by ChEMBL
Assay Description
Binding affinity towards human serum albumin
J Med Chem 48: 2469-79 (2005)
Article DOI: 10.1021/jm049227l
BindingDB Entry DOI: 10.7270/Q2125WDN
Bile salt export pump
(Rattus norvegicus)
BDBM50103504
(CHEBI:9352 | Clinoril | SULINDAC | Sulindac)
Show SMILES C[S+]([O-])c1ccc(\C=C2\C(C)=C(CC(O)=O)c3cc(F)ccc23)cc1 |t:10|
Show InChI InChI=1S/C20H17FO3S/c1-12-17(9-13-3-6-15(7-4-13)25(2)24)16-8-5-14(21)10-19(16)18(12)11-20(22)23/h3-10H,11H2,1-2H3,(H,22,23)/b17-9-
n/an/a 8.75E+4n/an/an/an/an/an/a
AstraZeneca
Curated by ChEMBL
Assay Description
Inhibition of Sprague-Dawley rat Bsep expressed in plasma membrane vesicles of Sf21 cells assessed as inhibition of ATP-dependent [3H]taurocholate up...
Drug Metab Dispos 40: 130-8 (2011)
Article DOI: 10.1124/dmd.111.040758
BindingDB Entry DOI: 10.7270/Q20Z7500
Bile salt export pump
(Homo sapiens (Human))
BDBM50103504
(CHEBI:9352 | Clinoril | SULINDAC | Sulindac)
Show SMILES C[S+]([O-])c1ccc(\C=C2\C(C)=C(CC(O)=O)c3cc(F)ccc23)cc1 |t:10|
Show InChI InChI=1S/C20H17FO3S/c1-12-17(9-13-3-6-15(7-4-13)25(2)24)16-8-5-14(21)10-19(16)18(12)11-20(22)23/h3-10H,11H2,1-2H3,(H,22,23)/b17-9-
n/an/a>1.35E+5n/an/an/an/an/an/a
Amgen Inc.
Curated by ChEMBL
Assay Description
Inhibition of human BSEP expressed in fall armyworm sf9 cell plasma membrane vesicles assessed as reduction in vesicle-associated [3H]-taurocholate t...
Toxicol Sci 118: 485-500 (2010)
Article DOI: 10.1093/toxsci/kfq269
BindingDB Entry DOI: 10.7270/Q26Q20JN
Bile salt export pump
(Homo sapiens (Human))
BDBM50103504
(CHEBI:9352 | Clinoril | SULINDAC | Sulindac)
Show SMILES C[S+]([O-])c1ccc(\C=C2\C(C)=C(CC(O)=O)c3cc(F)ccc23)cc1 |t:10|
Show InChI InChI=1S/C20H17FO3S/c1-12-17(9-13-3-6-15(7-4-13)25(2)24)16-8-5-14(21)10-19(16)18(12)11-20(22)23/h3-10H,11H2,1-2H3,(H,22,23)/b17-9-
n/an/a 6.37E+4n/an/an/an/an/an/a
AstraZeneca
Curated by ChEMBL
Assay Description
Inhibition of human BSEP expressed in baculovirus transfected fall armyworm Sf21 cell membranes vesicles assessed as reduction in ATP-dependent [3H]-...
Drug Metab Dispos 40: 2332-41 (2012)
Article DOI: 10.1124/dmd.112.047068
BindingDB Entry DOI: 10.7270/Q2ZP488M
Canalicular multispecific organic anion transporter 2
(Homo sapiens (Human))
BDBM50103504
(CHEBI:9352 | Clinoril | SULINDAC | Sulindac)
Show SMILES C[S+]([O-])c1ccc(\C=C2\C(C)=C(CC(O)=O)c3cc(F)ccc23)cc1 |t:10|
Show InChI InChI=1S/C20H17FO3S/c1-12-17(9-13-3-6-15(7-4-13)25(2)24)16-8-5-14(21)10-19(16)18(12)11-20(22)23/h3-10H,11H2,1-2H3,(H,22,23)/b17-9-
Reactome pathway
n/an/a 1.33E+5n/an/an/an/an/an/a
Amgen Inc
Curated by ChEMBL
Assay Description
Inhibition of human MRP3 overexpressed in Sf9 insect cell membrane vesicles assessed as uptake of [3H]-estradiol-17beta-D-glucuronide in presence of ...
Toxicol Sci 136: 216-41 (2013)
BindingDB Entry DOI: 10.7270/Q2JM2D2D
Bile salt export pump
(Homo sapiens (Human))
BDBM50103504
(CHEBI:9352 | Clinoril | SULINDAC | Sulindac)
Show SMILES C[S+]([O-])c1ccc(\C=C2\C(C)=C(CC(O)=O)c3cc(F)ccc23)cc1 |t:10|
Show InChI InChI=1S/C20H17FO3S/c1-12-17(9-13-3-6-15(7-4-13)25(2)24)16-8-5-14(21)10-19(16)18(12)11-20(22)23/h3-10H,11H2,1-2H3,(H,22,23)/b17-9-
n/an/a 1.33E+5n/an/an/an/an/an/a
Amgen Inc
Curated by ChEMBL
Assay Description
Inhibition of human BSEP overexpressed in Sf9 cell membrane vesicles assessed as uptake of [3H]-taurocholate in presence of ATP measured after 15 to ...
Toxicol Sci 136: 216-41 (2013)
BindingDB Entry DOI: 10.7270/Q2JM2D2D
Complement C5
(Homo sapiens)
BDBM50103504
(CHEBI:9352 | Clinoril | SULINDAC | Sulindac)
Show SMILES C[S+]([O-])c1ccc(\C=C2\C(C)=C(CC(O)=O)c3cc(F)ccc23)cc1 |t:10|
Show InChI InChI=1S/C20H17FO3S/c1-12-17(9-13-3-6-15(7-4-13)25(2)24)16-8-5-14(21)10-19(16)18(12)11-20(22)23/h3-10H,11H2,1-2H3,(H,22,23)/b17-9-
n/an/an/a 570n/an/an/an/an/a
Indian Institute of Technology Bhubaneswar
Curated by ChEMBL
Assay Description
Binding affinity to human C5a assessed as dissociation constant after 1 hr by circular dichroism analysis
Bioorg Med Chem 27: (2019)
Article DOI: 10.1016/j.bmc.2019.115052
Prostaglandin G/H synthase (cyclooxygenase)
(Ovis aries (Sheep))
BDBM50103504
(CHEBI:9352 | Clinoril | SULINDAC | Sulindac)
Show SMILES C[S+]([O-])c1ccc(\C=C2\C(C)=C(CC(O)=O)c3cc(F)ccc23)cc1 |t:10|
Show InChI InChI=1S/C20H17FO3S/c1-12-17(9-13-3-6-15(7-4-13)25(2)24)16-8-5-14(21)10-19(16)18(12)11-20(22)23/h3-10H,11H2,1-2H3,(H,22,23)/b17-9-
n/an/a 1.60E+4n/an/an/an/an/an/a
Guangzhou Institutes of Biomedicine and Health
Curated by ChEMBL
Assay Description
Inhibition of Ovine COX-1 preincubated for 15 mins by fluorescence analysis
ACS Med Chem Lett 6: 1086-90 (2015)
Article DOI: 10.1021/acsmedchemlett.5b00286
BindingDB Entry DOI: 10.7270/Q2ZG6W79
Epidermal growth factor receptor
(Homo sapiens (Human))
BDBM50103504
(CHEBI:9352 | Clinoril | SULINDAC | Sulindac)
Show SMILES C[S+]([O-])c1ccc(\C=C2\C(C)=C(CC(O)=O)c3cc(F)ccc23)cc1 |t:10|
Show InChI InChI=1S/C20H17FO3S/c1-12-17(9-13-3-6-15(7-4-13)25(2)24)16-8-5-14(21)10-19(16)18(12)11-20(22)23/h3-10H,11H2,1-2H3,(H,22,23)/b17-9-
n/an/a>1.00E+4n/an/an/an/an/an/a
Guangzhou Institutes of Biomedicine and Health
Curated by ChEMBL
Assay Description
Inhibition of EGFR (unknown origin) using tyrosine 4 as substrate by fluorescence analysis
ACS Med Chem Lett 6: 1086-90 (2015)
Article DOI: 10.1021/acsmedchemlett.5b00286
BindingDB Entry DOI: 10.7270/Q2ZG6W79
Prostaglandin E synthase/G/H synthase 2
(Homo sapiens (Human))
BDBM50103504
(CHEBI:9352 | Clinoril | SULINDAC | Sulindac)
Show SMILES C[S+]([O-])c1ccc(\C=C2\C(C)=C(CC(O)=O)c3cc(F)ccc23)cc1 |t:10|
Show InChI InChI=1S/C20H17FO3S/c1-12-17(9-13-3-6-15(7-4-13)25(2)24)16-8-5-14(21)10-19(16)18(12)11-20(22)23/h3-10H,11H2,1-2H3,(H,22,23)/b17-9-
NCI pathway
Reactome pathway
n/an/a 8.80E+3n/an/an/an/an/an/a
Guangzhou Institutes of Biomedicine and Health
Curated by ChEMBL
Assay Description
Inhibition of recombinant human COX-2 preincubated for 15 mins by fluorescence analysis
ACS Med Chem Lett 6: 1086-90 (2015)
Article DOI: 10.1021/acsmedchemlett.5b00286
BindingDB Entry DOI: 10.7270/Q2ZG6W79
Aldose reductase
(Homo sapiens (Human))
BDBM50103504
(CHEBI:9352 | Clinoril | SULINDAC | Sulindac)
Show SMILES C[S+]([O-])c1ccc(\C=C2\C(C)=C(CC(O)=O)c3cc(F)ccc23)cc1 |t:10|
Show InChI InChI=1S/C20H17FO3S/c1-12-17(9-13-3-6-15(7-4-13)25(2)24)16-8-5-14(21)10-19(16)18(12)11-20(22)23/h3-10H,11H2,1-2H3,(H,22,23)/b17-9-
n/an/a 374n/an/an/an/an/an/a
TBA
Assay Description
Inhibition of Homo sapiens (human) aldose reductase
Citation and Details
Article DOI: 10.1007/s00044-012-0367-5
BindingDB Entry DOI: 10.7270/Q2XP77VN
Bile salt export pump (BSEP)
(Homo sapiens (Human))
BDBM50103504
(CHEBI:9352 | Clinoril | SULINDAC | Sulindac)
Show SMILES C[S+]([O-])c1ccc(\C=C2\C(C)=C(CC(O)=O)c3cc(F)ccc23)cc1 |t:10|
Show InChI InChI=1S/C20H17FO3S/c1-12-17(9-13-3-6-15(7-4-13)25(2)24)16-8-5-14(21)10-19(16)18(12)11-20(22)23/h3-10H,11H2,1-2H3,(H,22,23)/b17-9-
n/an/a 2.26E+5n/an/an/an/an/an/a
AstraZeneca
Curated by ChEMBL
Assay Description
Inhibition of human BSEP expressed in plasma membrane vesicles of Sf21 cells assessed as inhibition of ATP-dependent [3H]taurocholate uptake
Drug Metab Dispos 40: 130-8 (2011)
Article DOI: 10.1124/dmd.111.040758
BindingDB Entry DOI: 10.7270/Q20Z7500
Multidrug resistance-associated protein 4
(Homo sapiens (Human))
BDBM50103504
(CHEBI:9352 | Clinoril | SULINDAC | Sulindac)
Show SMILES C[S+]([O-])c1ccc(\C=C2\C(C)=C(CC(O)=O)c3cc(F)ccc23)cc1 |t:10|
Show InChI InChI=1S/C20H17FO3S/c1-12-17(9-13-3-6-15(7-4-13)25(2)24)16-8-5-14(21)10-19(16)18(12)11-20(22)23/h3-10H,11H2,1-2H3,(H,22,23)/b17-9-
Reactome pathway
n/an/a 1.33E+5n/an/an/an/an/an/a
Amgen Inc
Curated by ChEMBL
Assay Description
Inhibition of human MRP4 overexpressed in Sf9 cell membrane vesicles assessed as uptake of [3H]-estradiol-17beta-D-glucuronide in presence of ATP and...
Toxicol Sci 136: 216-41 (2013)
BindingDB Entry DOI: 10.7270/Q2JM2D2D