BDBM50103565 CHEMBL3335788
SMILES: Cc1ccc(cc1)S(=O)(=O)NC[C@H]1O[C@@H](O)[C@H](NC(=O)\C=C\c2ccc(Cl)c(Cl)c2)[C@@H](O)[C@@H]1O
InChI Key: InChIKey=QYROCIZAUONYDT-VVNAIZANSA-N
Data: 1 IC50
Activity Spreadsheet -- Enzyme Inhibition Constant Data from BindingDB
Found 1 hit for monomerid = 50103565
Trg + Lig
Ki
nM
ΔG°
kcal/mole
IC50
nM
Kd
nM
EC50/IC50
nM
koff
s-1
kon
M-1s-1
pHTemp
°C
Hexokinase-2
(Homo sapiens (Human))
BDBM50103565
(CHEMBL3335788)
Show SMILES Cc1ccc(cc1)S(=O)(=O)NC[C@H]1O[C@@H](O)[C@H](NC(=O)\C=C\c2ccc(Cl)c(Cl)c2)[C@@H](O)[C@@H]1O |r|
Show InChI InChI=1S/C22H24Cl2N2O7S/c1-12-2-6-14(7-3-12)34(31,32)25-11-17-20(28)21(29)19(22(30)33-17)26-18(27)9-5-13-4-8-15(23)16(24)10-13/h2-10,17,19-22,25,28-30H,11H2,1H3,(H,26,27)/b9-5+/t17-,19-,20-,21-,22-/m1/s1
n/an/a>316n/an/an/an/an/an/a
Universit£ di Pisa
Curated by ChEMBL
Assay Description
Inhibition of hexokinase 2 (unknown origin)
Bioorg Med Chem Lett 24: 4915-25 (2014)
BindingDB Entry DOI: 10.7270/Q25Q4XV9