BDBM50103576 CHEMBL3337586
SMILES: COCCOc1ccc-2c(NC3(CCN(CC3)C(=O)c3ccc(OC)c(c3)N(C)C)c3cccn-23)c1
InChI Key: InChIKey=RIIFJYCHZCTTGN-UHFFFAOYSA-N
Data: 2 IC50
Activity Spreadsheet -- Enzyme Inhibition Constant Data from BindingDB
Found 2 hits for monomerid = 50103576
Trg + Lig
Ki
nM
ΔG°
kcal/mole
IC50
nM
Kd
nM
EC50/IC50
nM
koff
s-1
kon
M-1s-1
pHTemp
°C
Sodium channel protein type 5 subunit alpha
(Homo sapiens (Human))
BDBM50103576
(CHEMBL3337586)
Show SMILES COCCOc1ccc-2c(NC3(CCN(CC3)C(=O)c3ccc(OC)c(c3)N(C)C)c3cccn-23)c1
Show InChI InChI=1S/C28H34N4O4/c1-30(2)24-18-20(7-10-25(24)35-4)27(33)31-14-11-28(12-15-31)26-6-5-13-32(26)23-9-8-21(19-22(23)29-28)36-17-16-34-3/h5-10,13,18-19,29H,11-12,14-17H2,1-4H3
n/an/a 2.22E+3n/an/an/an/an/an/a
Merck Research Laboratory
Curated by ChEMBL
Assay Description
Inhibition of human Nav1.5 expressed in HEK293 cells after 60 mins by FLIPR assay
Bioorg Med Chem Lett 24: 4958-62 (2014)
BindingDB Entry DOI: 10.7270/Q21Z465T
Sodium channel protein type 9 subunit alpha
(Homo sapiens (Human))
BDBM50103576
(CHEMBL3337586)
Show SMILES COCCOc1ccc-2c(NC3(CCN(CC3)C(=O)c3ccc(OC)c(c3)N(C)C)c3cccn-23)c1
Show InChI InChI=1S/C28H34N4O4/c1-30(2)24-18-20(7-10-25(24)35-4)27(33)31-14-11-28(12-15-31)26-6-5-13-32(26)23-9-8-21(19-22(23)29-28)36-17-16-34-3/h5-10,13,18-19,29H,11-12,14-17H2,1-4H3
n/an/a 63n/an/an/an/an/an/a
Merck Research Laboratory
Curated by ChEMBL
Assay Description
Inhibition of human Nav1.7 expressed in HEK293 cells after 60 mins by FLIPR assay
Bioorg Med Chem Lett 24: 4958-62 (2014)
BindingDB Entry DOI: 10.7270/Q21Z465T