BDBM50103591 CHEMBL3337601
SMILES: COc1ccc-2c(NC3(CCN(CC3)C(=O)c3ccc4n(C)ccc4c3)c3cccn-23)c1
InChI Key: InChIKey=OQNZBBTUQPXYHS-UHFFFAOYSA-N
Data: 2 IC50
Activity Spreadsheet -- Enzyme Inhibition Constant Data from BindingDB
Found 2 hits for monomerid = 50103591
Trg + Lig
Ki
nM
ΔG°
kcal/mole
IC50
nM
Kd
nM
EC50/IC50
nM
koff
s-1
kon
M-1s-1
pHTemp
°C
Sodium channel protein type 5 subunit alpha
(Homo sapiens (Human))
BDBM50103591
(CHEMBL3337601)
Show SMILES COc1ccc-2c(NC3(CCN(CC3)C(=O)c3ccc4n(C)ccc4c3)c3cccn-23)c1
Show InChI InChI=1S/C26H26N4O2/c1-28-13-9-18-16-19(5-7-22(18)28)25(31)29-14-10-26(11-15-29)24-4-3-12-30(24)23-8-6-20(32-2)17-21(23)27-26/h3-9,12-13,16-17,27H,10-11,14-15H2,1-2H3
n/an/a 1.65E+3n/an/an/an/an/an/a
Merck Research Laboratory
Curated by ChEMBL
Assay Description
Inhibition of human Nav1.5 expressed in HEK293 cells after 60 mins by FLIPR assay
Bioorg Med Chem Lett 24: 4958-62 (2014)
BindingDB Entry DOI: 10.7270/Q21Z465T
Sodium channel protein type 9 subunit alpha
(Homo sapiens (Human))
BDBM50103591
(CHEMBL3337601)
Show SMILES COc1ccc-2c(NC3(CCN(CC3)C(=O)c3ccc4n(C)ccc4c3)c3cccn-23)c1
Show InChI InChI=1S/C26H26N4O2/c1-28-13-9-18-16-19(5-7-22(18)28)25(31)29-14-10-26(11-15-29)24-4-3-12-30(24)23-8-6-20(32-2)17-21(23)27-26/h3-9,12-13,16-17,27H,10-11,14-15H2,1-2H3
n/an/a 35n/an/an/an/an/an/a
Merck Research Laboratory
Curated by ChEMBL
Assay Description
Inhibition of human Nav1.7 expressed in HEK293 cells after 60 mins by FLIPR assay
Bioorg Med Chem Lett 24: 4958-62 (2014)
BindingDB Entry DOI: 10.7270/Q21Z465T