BDBM50103614 FAMPROFAZONE::Famprofazone
SMILES: CC(C)c1c(CN(C)C(C)Cc2ccccc2)n(C)n(-c2ccccc2)c1=O
InChI Key: InChIKey=GNUXVOXXWGNPIV-UHFFFAOYSA-N
Data: 5 EC50
Activity Spreadsheet -- Enzyme Inhibition Constant Data from BindingDB
Found 5 hits for monomerid = 50103614
Trg + Lig
Ki
nM
ΔG°
kcal/mole
IC50
nM
Kd
nM
EC50/IC50
nM
koff
s-1
kon
M-1s-1
pHTemp
°C
Nuclear receptor subfamily 1 group I member 2
(Rattus norvegicus)
BDBM50103614
(FAMPROFAZONE | Famprofazone)
Show SMILES CC(C)c1c(CN(C)C(C)Cc2ccccc2)n(C)n(-c2ccccc2)c1=O
Show InChI InChI=1S/C24H31N3O/c1-18(2)23-22(17-25(4)19(3)16-20-12-8-6-9-13-20)26(5)27(24(23)28)21-14-10-7-11-15-21/h6-15,18-19H,16-17H2,1-5H3
n/an/an/an/a 9.80E+3n/an/an/an/a
National Institutes of Health Chemical Genomics Center
Curated by ChEMBL
Assay Description
Activation of rat PXR expressed in human HepG2 cells after 24 hrs by luciferase reporter gene based luminescent analysis
Drug Metab Dispos 39: 151-9 (2010)
Article DOI: 10.1124/dmd.110.035105
BindingDB Entry DOI: 10.7270/Q2JS9S5P
Pregnane X receptor
(Homo sapiens (Human))
BDBM50103614
(FAMPROFAZONE | Famprofazone)
Show SMILES CC(C)c1c(CN(C)C(C)Cc2ccccc2)n(C)n(-c2ccccc2)c1=O
Show InChI InChI=1S/C24H31N3O/c1-18(2)23-22(17-25(4)19(3)16-20-12-8-6-9-13-20)26(5)27(24(23)28)21-14-10-7-11-15-21/h6-15,18-19H,16-17H2,1-5H3
n/an/an/an/a 5.10E+3n/an/an/an/a
National Institutes of Health Chemical Genomics Center
Curated by ChEMBL
Assay Description
Activation of human PXR expressed in human HepG2 (DPX-2) cells after 24 hrs by luciferase reporter gene based luminescent analysis
Drug Metab Dispos 39: 151-9 (2010)
Article DOI: 10.1124/dmd.110.035105
BindingDB Entry DOI: 10.7270/Q2JS9S5P
Pregnane X receptor
(Homo sapiens (Human))
BDBM50103614
(FAMPROFAZONE | Famprofazone)
Show SMILES CC(C)c1c(CN(C)C(C)Cc2ccccc2)n(C)n(-c2ccccc2)c1=O
Show InChI InChI=1S/C24H31N3O/c1-18(2)23-22(17-25(4)19(3)16-20-12-8-6-9-13-20)26(5)27(24(23)28)21-14-10-7-11-15-21/h6-15,18-19H,16-17H2,1-5H3
n/an/an/an/a 3.10E+3n/an/an/an/a
National Institutes of Health Chemical Genomics Center
Curated by ChEMBL
Assay Description
Activation of human PXR expressed in human HepG2 (DPX-2) cells assessed as induction of CYP3A4 after 24 hrs by luminescent analysis
Drug Metab Dispos 39: 151-9 (2010)
Article DOI: 10.1124/dmd.110.035105
BindingDB Entry DOI: 10.7270/Q2JS9S5P
Pregnane X receptor
(Homo sapiens (Human))
BDBM50103614
(FAMPROFAZONE | Famprofazone)
Show SMILES CC(C)c1c(CN(C)C(C)Cc2ccccc2)n(C)n(-c2ccccc2)c1=O
Show InChI InChI=1S/C24H31N3O/c1-18(2)23-22(17-25(4)19(3)16-20-12-8-6-9-13-20)26(5)27(24(23)28)21-14-10-7-11-15-21/h6-15,18-19H,16-17H2,1-5H3
n/an/an/an/a 1.40E+3n/an/an/an/a
National Institutes of Health Chemical Genomics Center
Curated by ChEMBL
Assay Description
Activation of PXR in human cryopreserved hepatocytes assessed as induction of CYP3A4
Drug Metab Dispos 39: 151-9 (2010)
Article DOI: 10.1124/dmd.110.035105
BindingDB Entry DOI: 10.7270/Q2JS9S5P
Pregnane X receptor
(Homo sapiens (Human))
BDBM50103614
(FAMPROFAZONE | Famprofazone)
Show SMILES CC(C)c1c(CN(C)C(C)Cc2ccccc2)n(C)n(-c2ccccc2)c1=O
Show InChI InChI=1S/C24H31N3O/c1-18(2)23-22(17-25(4)19(3)16-20-12-8-6-9-13-20)26(5)27(24(23)28)21-14-10-7-11-15-21/h6-15,18-19H,16-17H2,1-5H3
n/an/an/an/a 1.30E+3n/an/an/an/a
National Institutes of Health Chemical Genomics Center
Curated by ChEMBL
Assay Description
Competitive binding affinity to human PXR LBD (111 to 434) by TR-FRET assay
Drug Metab Dispos 39: 151-9 (2010)
Article DOI: 10.1124/dmd.110.035105
BindingDB Entry DOI: 10.7270/Q2JS9S5P