BDBM50103621 A-61589::AA-861::CHEBI:2340::DOCEBENONE::Docebenone
SMILES: CC1=C(C)C(=O)C(CCCCC#CCCCC#CCO)=C(C)C1=O
InChI Key: InChIKey=WDEABJKSGGRCQA-UHFFFAOYSA-N
Data: 3 EC50
Activity Spreadsheet -- Enzyme Inhibition Constant Data from BindingDB
Found 3 hits for monomerid = 50103621
Trg + Lig
Ki
nM
ΔG°
kcal/mole
IC50
nM
Kd
nM
EC50/IC50
nM
koff
s-1
kon
M-1s-1
pHTemp
°C
Pregnane X receptor
(Homo sapiens (Human))
BDBM50103621
(A-61589 | AA-861 | CHEBI:2340 | DOCEBENONE | Doceb...)
Show SMILES CC1=C(C)C(=O)C(CCCCC#CCCCC#CCO)=C(C)C1=O |c:1,t:19|
Show InChI InChI=1S/C21H26O3/c1-16-17(2)21(24)19(18(3)20(16)23)14-12-10-8-6-4-5-7-9-11-13-15-22/h22H,5,7-10,12,14-15H2,1-3H3
n/an/an/an/a 2.82E+4n/an/an/an/a
National Institutes of Health Chemical Genomics Center
Curated by ChEMBL
Assay Description
Activation of human PXR expressed in human HepG2 (DPX-2) cells after 24 hrs by luciferase reporter gene based luminescent analysis
Drug Metab Dispos 39: 151-9 (2010)
Article DOI: 10.1124/dmd.110.035105
BindingDB Entry DOI: 10.7270/Q2JS9S5P
Pregnane X receptor
(Homo sapiens (Human))
BDBM50103621
(A-61589 | AA-861 | CHEBI:2340 | DOCEBENONE | Doceb...)
Show SMILES CC1=C(C)C(=O)C(CCCCC#CCCCC#CCO)=C(C)C1=O |c:1,t:19|
Show InChI InChI=1S/C21H26O3/c1-16-17(2)21(24)19(18(3)20(16)23)14-12-10-8-6-4-5-7-9-11-13-15-22/h22H,5,7-10,12,14-15H2,1-3H3
n/an/an/an/a 1.26E+4n/an/an/an/a
National Institutes of Health Chemical Genomics Center
Curated by ChEMBL
Assay Description
Competitive binding affinity to human PXR LBD (111 to 434) by TR-FRET assay
Drug Metab Dispos 39: 151-9 (2010)
Article DOI: 10.1124/dmd.110.035105
BindingDB Entry DOI: 10.7270/Q2JS9S5P
Pregnane X receptor
(Homo sapiens (Human))
BDBM50103621
(A-61589 | AA-861 | CHEBI:2340 | DOCEBENONE | Doceb...)
Show SMILES CC1=C(C)C(=O)C(CCCCC#CCCCC#CCO)=C(C)C1=O |c:1,t:19|
Show InChI InChI=1S/C21H26O3/c1-16-17(2)21(24)19(18(3)20(16)23)14-12-10-8-6-4-5-7-9-11-13-15-22/h22H,5,7-10,12,14-15H2,1-3H3
n/an/an/an/a 7.10E+3n/an/an/an/a
National Institutes of Health Chemical Genomics Center
Curated by ChEMBL
Assay Description
Activation of human PXR expressed in human HepG2 (DPX-2) cells assessed as induction of CYP3A4 after 24 hrs by luminescent analysis
Drug Metab Dispos 39: 151-9 (2010)
Article DOI: 10.1124/dmd.110.035105
BindingDB Entry DOI: 10.7270/Q2JS9S5P