null
SMILES: [H][C@]12C[C@H](OC(=O)C[C@H](O)C(C)(C)C(=O)[C@H](C)[C@@H](O)[C@@H](C)CCC[C@@]1(C)O2)C(\C)=C\c1csc(C)n1
InChI Key: InChIKey=QXRSDHAAWVKZLJ-PVYNADRNSA-N
PDB links: 4 PDB IDs match this monomer.
Activity Spreadsheet -- Enzyme Inhibition Constant Data from BindingDB
Found 3 hits for monomerid = 50103627
Trg + Lig
Ki
nM
ΔG°
kcal/mole
IC50
nM
Kd
nM
EC50/IC50
nM
koff
s-1
kon
M-1s-1
pHTemp
°C
Nuclear receptor subfamily 1 group I member 2
(Rattus norvegicus)
BDBM50103627
(CHEBI:31550 | GNF-Pf-193 | Patupilone)
Show SMILES [H][C@]12C[C@H](OC(=O)C[C@H](O)C(C)(C)C(=O)[C@H](C)[C@@H](O)[C@@H](C)CCC[C@@]1(C)O2)C(\C)=C\c1csc(C)n1 |r|
Show InChI InChI=1S/C27H41NO6S/c1-15-9-8-10-27(7)22(34-27)12-20(16(2)11-19-14-35-18(4)28-19)33-23(30)13-21(29)26(5,6)25(32)17(3)24(15)31/h11,14-15,17,20-22,24,29,31H,8-10,12-13H2,1-7H3/b16-11+/t15-,17+,20-,21-,22-,24-,27+/m0/s1
n/an/an/an/a 10n/an/an/an/a
National Institutes of Health Chemical Genomics Center
Curated by ChEMBL
Assay Description
Activation of rat PXR expressed in human HepG2 cells after 24 hrs by luciferase reporter gene based luminescent analysis
Drug Metab Dispos 39: 151-9 (2010)
Article DOI: 10.1124/dmd.110.035105
BindingDB Entry DOI: 10.7270/Q2JS9S5P
Nuclear receptor subfamily 1 group I member 2
(Homo sapiens (Human))
BDBM50103627
(CHEBI:31550 | GNF-Pf-193 | Patupilone)
Show SMILES [H][C@]12C[C@H](OC(=O)C[C@H](O)C(C)(C)C(=O)[C@H](C)[C@@H](O)[C@@H](C)CCC[C@@]1(C)O2)C(\C)=C\c1csc(C)n1 |r|
Show InChI InChI=1S/C27H41NO6S/c1-15-9-8-10-27(7)22(34-27)12-20(16(2)11-19-14-35-18(4)28-19)33-23(30)13-21(29)26(5,6)25(32)17(3)24(15)31/h11,14-15,17,20-22,24,29,31H,8-10,12-13H2,1-7H3/b16-11+/t15-,17+,20-,21-,22-,24-,27+/m0/s1
n/an/an/an/a 3.16E+4n/an/an/an/a
National Institutes of Health Chemical Genomics Center
Curated by ChEMBL
Assay Description
Competitive binding affinity to human PXR LBD (111 to 434) by TR-FRET assay
Drug Metab Dispos 39: 151-9 (2010)
Article DOI: 10.1124/dmd.110.035105
BindingDB Entry DOI: 10.7270/Q2JS9S5P
Nuclear receptor subfamily 1 group I member 2
(Homo sapiens (Human))
BDBM50103627
(CHEBI:31550 | GNF-Pf-193 | Patupilone)
Show SMILES [H][C@]12C[C@H](OC(=O)C[C@H](O)C(C)(C)C(=O)[C@H](C)[C@@H](O)[C@@H](C)CCC[C@@]1(C)O2)C(\C)=C\c1csc(C)n1 |r|
Show InChI InChI=1S/C27H41NO6S/c1-15-9-8-10-27(7)22(34-27)12-20(16(2)11-19-14-35-18(4)28-19)33-23(30)13-21(29)26(5,6)25(32)17(3)24(15)31/h11,14-15,17,20-22,24,29,31H,8-10,12-13H2,1-7H3/b16-11+/t15-,17+,20-,21-,22-,24-,27+/m0/s1
n/an/an/an/a 1.26E+4n/an/an/an/a
National Institutes of Health Chemical Genomics Center
Curated by ChEMBL
Assay Description
Activation of human PXR expressed in human HepG2 (DPX-2) cells after 24 hrs by luciferase reporter gene based luminescent analysis
Drug Metab Dispos 39: 151-9 (2010)
Article DOI: 10.1124/dmd.110.035105
BindingDB Entry DOI: 10.7270/Q2JS9S5P