BDBM50103951 3-(4-(2-(5-(4-fluorophenyl)-1,2,4-oxadiazol-3-yl)ethoxy)phenyl)-2-isopropoxypropanoic acid::3-(4-{2-[5-(4-Fluoro-phenyl)-[1,2,4]oxadiazol-3-yl]-ethoxy}-phenyl)-2-isopropoxy-propionic acid::CHEMBL262981
SMILES: CC(C)OC(Cc1ccc(OCCc2noc(n2)-c2ccc(F)cc2)cc1)C(O)=O
InChI Key: InChIKey=STGWLVIBJLXXID-UHFFFAOYSA-N
Data: 5 EC50
Activity Spreadsheet -- Enzyme Inhibition Constant Data from BindingDB
Found 5 hits for monomerid = 50103951
Trg + Lig
Ki
nM
ΔG°
kcal/mole
IC50
nM
Kd
nM
EC50/IC50
nM
koff
s-1
kon
M-1s-1
pHTemp
°C
Peroxisome proliferator-activated receptor gamma
(Homo sapiens (Human))
BDBM50103951
(3-(4-(2-(5-(4-fluorophenyl)-1,2,4-oxadiazol-3-yl)e...)
Show SMILES CC(C)OC(Cc1ccc(OCCc2noc(n2)-c2ccc(F)cc2)cc1)C(O)=O
Show InChI InChI=1S/C22H23FN2O5/c1-14(2)29-19(22(26)27)13-15-3-9-18(10-4-15)28-12-11-20-24-21(30-25-20)16-5-7-17(23)8-6-16/h3-10,14,19H,11-13H2,1-2H3,(H,26,27)
NCI pathway
Reactome pathway
n/an/an/an/a 40n/an/an/an/a
GlaxoSmithKline
Curated by ChEMBL
Assay Description
Agonist activity against human Peroxisome proliferator activated receptor gamma receptor in CV-1 cell was determined
Bioorg Med Chem Lett 11: 2385-8 (2001)
BindingDB Entry DOI: 10.7270/Q2CJ8CSF
Peroxisome proliferator-activated receptor alpha
(Homo sapiens (Human))
BDBM50103951
(3-(4-(2-(5-(4-fluorophenyl)-1,2,4-oxadiazol-3-yl)e...)
Show SMILES CC(C)OC(Cc1ccc(OCCc2noc(n2)-c2ccc(F)cc2)cc1)C(O)=O
Show InChI InChI=1S/C22H23FN2O5/c1-14(2)29-19(22(26)27)13-15-3-9-18(10-4-15)28-12-11-20-24-21(30-25-20)16-5-7-17(23)8-6-16/h3-10,14,19H,11-13H2,1-2H3,(H,26,27)
n/an/an/an/a 790n/an/an/an/a
GlaxoSmithKline
Curated by ChEMBL
Assay Description
Agonist activity against human Peroxisome proliferator activated receptor alpha receptor in CV-1 cell was determined
Bioorg Med Chem Lett 11: 2385-8 (2001)
BindingDB Entry DOI: 10.7270/Q2CJ8CSF
Peroxisome proliferator-activated receptor alpha
(Homo sapiens (Human))
BDBM50103951
(3-(4-(2-(5-(4-fluorophenyl)-1,2,4-oxadiazol-3-yl)e...)
Show SMILES CC(C)OC(Cc1ccc(OCCc2noc(n2)-c2ccc(F)cc2)cc1)C(O)=O
Show InChI InChI=1S/C22H23FN2O5/c1-14(2)29-19(22(26)27)13-15-3-9-18(10-4-15)28-12-11-20-24-21(30-25-20)16-5-7-17(23)8-6-16/h3-10,14,19H,11-13H2,1-2H3,(H,26,27)
n/an/an/an/a 1.27E+6n/an/an/an/a
TBA
Assay Description
Agonist activity at PPARalpha (unknown origin)
Citation and Details
Article DOI: 10.1007/s00044-004-0110-y
BindingDB Entry DOI: 10.7270/Q2DJ5JH3
Peroxisome proliferator-activated receptor gamma
(Homo sapiens (Human))
BDBM50103951
(3-(4-(2-(5-(4-fluorophenyl)-1,2,4-oxadiazol-3-yl)e...)
Show SMILES CC(C)OC(Cc1ccc(OCCc2noc(n2)-c2ccc(F)cc2)cc1)C(O)=O
Show InChI InChI=1S/C22H23FN2O5/c1-14(2)29-19(22(26)27)13-15-3-9-18(10-4-15)28-12-11-20-24-21(30-25-20)16-5-7-17(23)8-6-16/h3-10,14,19H,11-13H2,1-2H3,(H,26,27)
NCI pathway
Reactome pathway
n/an/an/an/a 40n/an/an/an/a
National Institute of Pharmaceutical Education and Research
Curated by ChEMBL
Assay Description
Agonist activity at human PPARgamma expressed in african green monkey CV1 cells cotransfected with Gal4 assessed as reporter activty by transient tra...
Eur J Med Chem 43: 2784-91 (2008)
Article DOI: 10.1016/j.ejmech.2008.01.017
BindingDB Entry DOI: 10.7270/Q2W095QK
Peroxisome proliferator-activated receptor alpha
(Homo sapiens (Human))
BDBM50103951
(3-(4-(2-(5-(4-fluorophenyl)-1,2,4-oxadiazol-3-yl)e...)
Show SMILES CC(C)OC(Cc1ccc(OCCc2noc(n2)-c2ccc(F)cc2)cc1)C(O)=O
Show InChI InChI=1S/C22H23FN2O5/c1-14(2)29-19(22(26)27)13-15-3-9-18(10-4-15)28-12-11-20-24-21(30-25-20)16-5-7-17(23)8-6-16/h3-10,14,19H,11-13H2,1-2H3,(H,26,27)
n/an/an/an/a 790n/an/an/an/a
National Institute of Pharmaceutical Education and Research
Curated by ChEMBL
Assay Description
Agonist activity at human PPARalpha expressed in african green monkey CV1 cells cotransfected with Gal4 assessed as reporter activty by transient tra...
Eur J Med Chem 43: 2784-91 (2008)
Article DOI: 10.1016/j.ejmech.2008.01.017
BindingDB Entry DOI: 10.7270/Q2W095QK