BDBM50104019 CHEMBL323265::Phosphoric acid mono-[2-(2-chloro-6-methylamino-purin-9-ylmethyl)-3-phosphonooxymethyl-cyclopropylmethyl] ester
SMILES: CNc1nc(Cl)nc2n(C[C@H]3[C@@H](COP(O)(O)=O)[C@H]3COP(O)(O)=O)cnc12
InChI Key: InChIKey=HXASCSAZFAJEGQ-RNLVFQAGSA-N
Data: 1 IC50
Activity Spreadsheet -- Enzyme Inhibition Constant Data from BindingDB
Found 1 hit for monomerid = 50104019
Trg + Lig
Ki
nM
ΔG°
kcal/mole
IC50
nM
Kd
nM
EC50/IC50
nM
koff
s-1
kon
M-1s-1
pHTemp
°C
P2Y purinoceptor 1
(Meleagris gallopavo)
BDBM50104019
(CHEMBL323265 | Phosphoric acid mono-[2-(2-chloro-6...)
Show SMILES CNc1nc(Cl)nc2n(C[C@H]3[C@@H](COP(O)(O)=O)[C@H]3COP(O)(O)=O)cnc12
Show InChI InChI=1S/C12H18ClN5O8P2/c1-14-10-9-11(17-12(13)16-10)18(5-15-9)2-6-7(3-25-27(19,20)21)8(6)4-26-28(22,23)24/h5-8H,2-4H2,1H3,(H,14,16,17)(H2,19,20,21)(H2,22,23,24)/t6-,7+,8-
n/an/a 2.17E+3n/an/an/an/an/an/a
National Institute of Diabetes
Curated by ChEMBL
Assay Description
Inhibitory concentration against P2Y1 receptor in turkey erythrocyte membranes
J Med Chem 44: 3092-108 (2001)
BindingDB Entry DOI: 10.7270/Q20864KX