BDBM50104021 CHEMBL104752::Phosphoric acid mono-[2-(2-chloro-6-methylamino-purin-9-ylmethyl)-1-phosphonooxymethyl-cyclopropylmethyl] ester
SMILES: CNc1nc(Cl)nc2n(CC3CC3(COP(O)(O)=O)COP(O)(O)=O)cnc12
InChI Key: InChIKey=JOOHTGMCSCZVNR-UHFFFAOYSA-N
Data: 1 IC50
Activity Spreadsheet -- Enzyme Inhibition Constant Data from BindingDB
Found 1 hit for monomerid = 50104021
Trg + Lig
Ki
nM
ΔG°
kcal/mole
IC50
nM
Kd
nM
EC50/IC50
nM
koff
s-1
kon
M-1s-1
pHTemp
°C
P2Y purinoceptor 1
(Meleagris gallopavo)
BDBM50104021
(CHEMBL104752 | Phosphoric acid mono-[2-(2-chloro-6...)
Show SMILES CNc1nc(Cl)nc2n(CC3CC3(COP(O)(O)=O)COP(O)(O)=O)cnc12
Show InChI InChI=1S/C12H18ClN5O8P2/c1-14-9-8-10(17-11(13)16-9)18(6-15-8)3-7-2-12(7,4-25-27(19,20)21)5-26-28(22,23)24/h6-7H,2-5H2,1H3,(H,14,16,17)(H2,19,20,21)(H2,22,23,24)
n/an/a 1.90E+3n/an/an/an/an/an/a
National Institute of Diabetes
Curated by ChEMBL
Assay Description
Inhibitory concentration against P2Y1 receptor in turkey erythrocyte membranes
J Med Chem 44: 3092-108 (2001)
BindingDB Entry DOI: 10.7270/Q20864KX