BDBM50104283 CHEMBL3593717
SMILES: CN1C(NC(=O)c2cccnc12)c1ccc(NC(=O)C2CCC2)cc1
InChI Key: InChIKey=NJIYMBZJQYRCJQ-UHFFFAOYSA-N
Data: 2 IC50
Activity Spreadsheet -- Enzyme Inhibition Constant Data from BindingDB
Found 2 hits for monomerid = 50104283
Trg + Lig
Ki
nM
ΔG°
kcal/mole
IC50
nM
Kd
nM
EC50/IC50
nM
koff
s-1
kon
M-1s-1
pHTemp
°C
Poly [ADP-ribose] polymerase tankyrase-2
(Homo sapiens (Human))
BDBM50104283
(CHEMBL3593717)
Show SMILES CN1C(NC(=O)c2cccnc12)c1ccc(NC(=O)C2CCC2)cc1
Show InChI InChI=1S/C19H20N4O2/c1-23-16(22-19(25)15-6-3-11-20-17(15)23)12-7-9-14(10-8-12)21-18(24)13-4-2-5-13/h3,6-11,13,16H,2,4-5H2,1H3,(H,21,24)(H,22,25)
n/an/a 2.34E+3n/an/an/an/an/an/a
University of Oulu
Curated by ChEMBL
Assay Description
Inhibition of human TNKS2 (956 to 1161 and 873 to 1161) using 500 nM NAD substrate after 20 mins incubation by fluorescence assay
Bioorg Med Chem 23: 4139-49 (2015)
Article DOI: 10.1016/j.bmc.2015.06.063
BindingDB Entry DOI: 10.7270/Q2W66NJ2
Poly [ADP-ribose] polymerase tankyrase-2
(Homo sapiens (Human))
BDBM50104283
(CHEMBL3593717)
Show SMILES CN1C(NC(=O)c2cccnc12)c1ccc(NC(=O)C2CCC2)cc1
Show InChI InChI=1S/C19H20N4O2/c1-23-16(22-19(25)15-6-3-11-20-17(15)23)12-7-9-14(10-8-12)21-18(24)13-4-2-5-13/h3,6-11,13,16H,2,4-5H2,1H3,(H,21,24)(H,22,25)
n/an/a 2.30E+3n/an/an/an/an/an/a
University of Oulu
Curated by ChEMBL
Assay Description
Inhibition of human TNKS2 (956 to 1161 and 873 to 1161) using 500 nM NAD substrate after 20 mins incubation by fluorescence assay
Bioorg Med Chem 23: 4139-49 (2015)
Article DOI: 10.1016/j.bmc.2015.06.063
BindingDB Entry DOI: 10.7270/Q2W66NJ2