BDBM50104297 CHEMBL3594130
SMILES: Cc1ccccc1C1NC(=O)c2ccccc2N1
InChI Key: InChIKey=HEXRIGFWUUMZHO-UHFFFAOYSA-N
Data: 1 IC50
Activity Spreadsheet -- Enzyme Inhibition Constant Data from BindingDB
Found 1 hit for monomerid = 50104297
Trg + Lig
Ki
nM
ΔG°
kcal/mole
IC50
nM
Kd
nM
EC50/IC50
nM
koff
s-1
kon
M-1s-1
pHTemp
°C
Poly [ADP-ribose] polymerase tankyrase-2
(Homo sapiens (Human))
BDBM50104297
(CHEMBL3594130)
Show SMILES Cc1ccccc1C1NC(=O)c2ccccc2N1
Show InChI InChI=1S/C15H14N2O/c1-10-6-2-3-7-11(10)14-16-13-9-5-4-8-12(13)15(18)17-14/h2-9,14,16H,1H3,(H,17,18)
n/an/a 9.20E+4n/an/an/an/an/an/a
University of Oulu
Curated by ChEMBL
Assay Description
Inhibition of human TNKS2 (956 to 1161 and 873 to 1161) using 500 nM NAD substrate after 20 mins incubation by fluorescence assay
Bioorg Med Chem 23: 4139-49 (2015)
Article DOI: 10.1016/j.bmc.2015.06.063
BindingDB Entry DOI: 10.7270/Q2W66NJ2