BDBM50104314 (S)-[(S)-2-Amino-3-(4-hydroxy-phenyl)-propionylamino]-cyclohexyl-acetic acid methyl ester::CHEMBL309467
SMILES: COC(=O)[C@@H](NC(=O)[C@@H](N)Cc1ccc(O)cc1)C1CCCCC1
InChI Key: InChIKey=NFMPCWZITVVQKV-HOTGVXAUSA-N
Data: 1 IC50
Activity Spreadsheet -- Enzyme Inhibition Constant Data from BindingDB
Found 1 hit for monomerid = 50104314
Trg + Lig
Ki
nM
ΔG°
kcal/mole
IC50
nM
Kd
nM
EC50/IC50
nM
koff
s-1
kon
M-1s-1
pHTemp
°C
Tyrosyl-tRNA synthetase
(Homo sapiens (Human))
BDBM50104314
((S)-[(S)-2-Amino-3-(4-hydroxy-phenyl)-propionylami...)
Show SMILES COC(=O)[C@@H](NC(=O)[C@@H](N)Cc1ccc(O)cc1)C1CCCCC1
Show InChI InChI=1S/C18H26N2O4/c1-24-18(23)16(13-5-3-2-4-6-13)20-17(22)15(19)11-12-7-9-14(21)10-8-12/h7-10,13,15-16,21H,2-6,11,19H2,1H3,(H,20,22)/t15-,16-/m0/s1
Reactome pathway
n/an/a>3.00E+3n/an/an/an/an/an/a
GlaxoSmithKline Pharmaceuticals
Curated by ChEMBL
Assay Description
Inhibitory activity against Bacterial Tyrosyl tRNA Synthetase
Bioorg Med Chem Lett 11: 2499-502 (2001)
BindingDB Entry DOI: 10.7270/Q2Z89BPK