BDBM50104501 (R)-2-[(Formyl-hydroxy-amino)-methyl]-hexanoic acid ((S)-1-dimethylcarbamoyl-2,2-dimethyl-propyl)-amide::(R)-2-[(Formyl-hydroxy-amino)-methyl]-hexanoic acid ((S)-1-dimethylcarbamoyl-2-methyl-2-methyl-propyl)-amide::(R)-2-[(Formyl-hydroxy-amino)-methyl]-hexanoic acid (1-dimethylcarbamoyl-2,2-dimethyl-propyl)-amide::(R)-2-[(Formyl-hydroxy-amino)-methyl]-hexanoic acid [1-((S)-dimethyl-carbamoyl)-2,2-dimethyl-propyl]-amide::2-[(FORMYL-HYDROXY-AMINO)-METHYL]-HEXANOIC ACID (1-DIMETHYLCARBAMOYL-2,2-DIMETHYL-PROPYL)-AMIDE::BB-3497::CHEMBL431210
SMILES: CCCC[C@H](CN(O)C=O)C(=O)N[C@H](C(=O)N(C)C)C(C)(C)C
InChI Key: InChIKey=AVDLWYHBABSSHC-CHWSQXEVSA-N
Data: 1 KI  12 IC50
PDB links: 1 PDB ID matches this monomer.
Activity Spreadsheet -- Enzyme Inhibition Constant Data from BindingDB
Found 13 hits for monomerid = 50104501
Trg + Lig
Ki
nM
ΔG°
kcal/mole
IC50
nM
Kd
nM
EC50/IC50
nM
koff
s-1
kon
M-1s-1
pHTemp
°C
Peptide deformylase
(Escherichia coli)
BDBM50104501
((R)-2-[(Formyl-hydroxy-amino)-methyl]-hexanoic aci...)
Show SMILES CCCC[C@H](CN(O)C=O)C(=O)N[C@H](C(=O)N(C)C)C(C)(C)C
Show InChI InChI=1S/C16H31N3O4/c1-7-8-9-12(10-19(23)11-20)14(21)17-13(16(2,3)4)15(22)18(5)6/h11-13,23H,7-10H2,1-6H3,(H,17,21)/t12-,13-/m1/s1
11n/an/an/an/an/an/an/an/a
The Ohio State University
Curated by ChEMBL
Assay Description
Inhibitory effect against E. coli peptide deformylase (PDF) by DPPI assay
J Med Chem 47: 4941-9 (2004)
Article DOI: 10.1021/jm049592c
BindingDB Entry DOI: 10.7270/Q2WD401S
3D
3D Structure (crystal)
Peptide deformylase
(Escherichia coli)
BDBM50104501
((R)-2-[(Formyl-hydroxy-amino)-methyl]-hexanoic aci...)
Show SMILES CCCC[C@H](CN(O)C=O)C(=O)N[C@H](C(=O)N(C)C)C(C)(C)C
Show InChI InChI=1S/C16H31N3O4/c1-7-8-9-12(10-19(23)11-20)14(21)17-13(16(2,3)4)15(22)18(5)6/h11-13,23H,7-10H2,1-6H3,(H,17,21)/t12-,13-/m1/s1
n/an/a 7n/an/an/an/an/an/a
British Biotech Pharmaceuticals Limited
Curated by ChEMBL
Assay Description
Inhibitory activity against Escherichia coli peptide deformylase (PDF) Nickel containing enzyme
Bioorg Med Chem Lett 14: 59-62 (2003)
BindingDB Entry DOI: 10.7270/Q2T43SHT
3D
3D Structure (crystal)
Angiotensin-converting enzyme
(Homo sapiens (Human))
BDBM50104501
((R)-2-[(Formyl-hydroxy-amino)-methyl]-hexanoic aci...)
Show SMILES CCCC[C@H](CN(O)C=O)C(=O)N[C@H](C(=O)N(C)C)C(C)(C)C
Show InChI InChI=1S/C16H31N3O4/c1-7-8-9-12(10-19(23)11-20)14(21)17-13(16(2,3)4)15(22)18(5)6/h11-13,23H,7-10H2,1-6H3,(H,17,21)/t12-,13-/m1/s1
Reactome pathway
n/an/a>1.00E+5n/an/an/an/an/an/a
British Biotech Pharmaceuticals Limited
Curated by ChEMBL
Assay Description
Compound was tested for its inhibitory activity against Angiotensin I converting enzyme
Bioorg Med Chem Lett 11: 2585-8 (2001)
BindingDB Entry DOI: 10.7270/Q2SN0886
Neprilysin
(Homo sapiens (Human))
BDBM50104501
((R)-2-[(Formyl-hydroxy-amino)-methyl]-hexanoic aci...)
Show SMILES CCCC[C@H](CN(O)C=O)C(=O)N[C@H](C(=O)N(C)C)C(C)(C)C
Show InChI InChI=1S/C16H31N3O4/c1-7-8-9-12(10-19(23)11-20)14(21)17-13(16(2,3)4)15(22)18(5)6/h11-13,23H,7-10H2,1-6H3,(H,17,21)/t12-,13-/m1/s1
n/an/a 5.00E+4n/an/an/an/an/an/a
British Biotech Pharmaceuticals Limited
Curated by ChEMBL
Assay Description
The compound was evaluated in vitro for the inhibition of Neutral endopeptidase
Bioorg Med Chem Lett 11: 2585-8 (2001)
BindingDB Entry DOI: 10.7270/Q2SN0886
Stromelysin-1
(Homo sapiens (Human))
BDBM50104501
((R)-2-[(Formyl-hydroxy-amino)-methyl]-hexanoic aci...)
Show SMILES CCCC[C@H](CN(O)C=O)C(=O)N[C@H](C(=O)N(C)C)C(C)(C)C
Show InChI InChI=1S/C16H31N3O4/c1-7-8-9-12(10-19(23)11-20)14(21)17-13(16(2,3)4)15(22)18(5)6/h11-13,23H,7-10H2,1-6H3,(H,17,21)/t12-,13-/m1/s1
Reactome pathway
n/an/a>1.00E+5n/an/an/an/an/an/a
British Biotech Pharmaceuticals Limited
Curated by ChEMBL
Assay Description
Inhibition of Matrix metalloproteinase-3
Bioorg Med Chem Lett 11: 2585-8 (2001)
BindingDB Entry DOI: 10.7270/Q2SN0886
Peptide deformylase mitochondrial
(Homo sapiens (Human))
BDBM50104501
((R)-2-[(Formyl-hydroxy-amino)-methyl]-hexanoic aci...)
Show SMILES CCCC[C@H](CN(O)C=O)C(=O)N[C@H](C(=O)N(C)C)C(C)(C)C
Show InChI InChI=1S/C16H31N3O4/c1-7-8-9-12(10-19(23)11-20)14(21)17-13(16(2,3)4)15(22)18(5)6/h11-13,23H,7-10H2,1-6H3,(H,17,21)/t12-,13-/m1/s1
n/an/a 7n/an/an/an/an/an/a
British Biotech Pharmaceuticals Limited
Curated by ChEMBL
Assay Description
Antibacterial activity of the compound against E. coli Peptide deformylase. Ni
Bioorg Med Chem Lett 11: 2585-8 (2001)
BindingDB Entry DOI: 10.7270/Q2SN0886
Peptide deformylase
(Escherichia coli)
BDBM50104501
((R)-2-[(Formyl-hydroxy-amino)-methyl]-hexanoic aci...)
Show SMILES CCCC[C@H](CN(O)C=O)C(=O)N[C@H](C(=O)N(C)C)C(C)(C)C
Show InChI InChI=1S/C16H31N3O4/c1-7-8-9-12(10-19(23)11-20)14(21)17-13(16(2,3)4)15(22)18(5)6/h11-13,23H,7-10H2,1-6H3,(H,17,21)/t12-,13-/m1/s1
n/an/a 7n/an/an/an/an/an/a
British Biotech Pharmaceuticals Limited
Curated by ChEMBL
Assay Description
Inhibition concentration against Escherichia coli peptide deformylase.
Bioorg Med Chem Lett 13: 2715-8 (2003)
BindingDB Entry DOI: 10.7270/Q2VQ336P
3D
3D Structure (crystal)
Matrix metalloproteinase-7 (MMP7)
(Homo sapiens (Human))
BDBM50104501
((R)-2-[(Formyl-hydroxy-amino)-methyl]-hexanoic aci...)
Show SMILES CCCC[C@H](CN(O)C=O)C(=O)N[C@H](C(=O)N(C)C)C(C)(C)C
Show InChI InChI=1S/C16H31N3O4/c1-7-8-9-12(10-19(23)11-20)14(21)17-13(16(2,3)4)15(22)18(5)6/h11-13,23H,7-10H2,1-6H3,(H,17,21)/t12-,13-/m1/s1
Reactome pathway
n/an/a>1.00E+5n/an/an/an/an/an/a
British Biotech Pharmaceuticals Limited
Curated by ChEMBL
Assay Description
Inhibition of Matrix metalloproteinase-7
Bioorg Med Chem Lett 11: 2585-8 (2001)
BindingDB Entry DOI: 10.7270/Q2SN0886
Interstitial collagenase
(Homo sapiens (Human))
BDBM50104501
((R)-2-[(Formyl-hydroxy-amino)-methyl]-hexanoic aci...)
Show SMILES CCCC[C@H](CN(O)C=O)C(=O)N[C@H](C(=O)N(C)C)C(C)(C)C
Show InChI InChI=1S/C16H31N3O4/c1-7-8-9-12(10-19(23)11-20)14(21)17-13(16(2,3)4)15(22)18(5)6/h11-13,23H,7-10H2,1-6H3,(H,17,21)/t12-,13-/m1/s1
Reactome pathway
n/an/a 2.00E+3n/an/an/an/an/an/a
British Biotech Pharmaceuticals Limited
Curated by ChEMBL
Assay Description
Inhibition of human Matrix metalloproteinase-1
Bioorg Med Chem Lett 11: 2585-8 (2001)
BindingDB Entry DOI: 10.7270/Q2SN0886
Peptide deformylase mitochondrial
(Homo sapiens (Human))
BDBM50104501
((R)-2-[(Formyl-hydroxy-amino)-methyl]-hexanoic aci...)
Show SMILES CCCC[C@H](CN(O)C=O)C(=O)N[C@H](C(=O)N(C)C)C(C)(C)C
Show InChI InChI=1S/C16H31N3O4/c1-7-8-9-12(10-19(23)11-20)14(21)17-13(16(2,3)4)15(22)18(5)6/h11-13,23H,7-10H2,1-6H3,(H,17,21)/t12-,13-/m1/s1
n/an/a 7n/an/an/an/an/an/a
British Biotech Pharmaceuticals Limited
Curated by ChEMBL
Assay Description
Compound was evaluated for inhibition of peptide deformylase, PDF.Ni of Escherichia coli
Bioorg Med Chem Lett 12: 3595-9 (2002)
BindingDB Entry DOI: 10.7270/Q2FJ2G4H
Peptide deformylase mitochondrial
(Homo sapiens (Human))
BDBM50104501
((R)-2-[(Formyl-hydroxy-amino)-methyl]-hexanoic aci...)
Show SMILES CCCC[C@H](CN(O)C=O)C(=O)N[C@H](C(=O)N(C)C)C(C)(C)C
Show InChI InChI=1S/C16H31N3O4/c1-7-8-9-12(10-19(23)11-20)14(21)17-13(16(2,3)4)15(22)18(5)6/h11-13,23H,7-10H2,1-6H3,(H,17,21)/t12-,13-/m1/s1
n/an/a 7n/an/an/an/an/an/a
British Biotech Pharmaceuticals Limited
Curated by ChEMBL
Assay Description
Inhibition against Escherichia coli peptide deformylase
Bioorg Med Chem Lett 13: 2709-13 (2003)
BindingDB Entry DOI: 10.7270/Q2XW4J6S
Peptide deformylase
(Escherichia coli)
BDBM50104501
((R)-2-[(Formyl-hydroxy-amino)-methyl]-hexanoic aci...)
Show SMILES CCCC[C@H](CN(O)C=O)C(=O)N[C@H](C(=O)N(C)C)C(C)(C)C
Show InChI InChI=1S/C16H31N3O4/c1-7-8-9-12(10-19(23)11-20)14(21)17-13(16(2,3)4)15(22)18(5)6/h11-13,23H,7-10H2,1-6H3,(H,17,21)/t12-,13-/m1/s1
n/an/a 40n/an/an/an/an/an/a
British Biotech Pharmaceuticals Limited
Curated by ChEMBL
Assay Description
Inhibition concentration against Escherichia coli peptide deformylase.
Bioorg Med Chem Lett 13: 2715-8 (2003)
BindingDB Entry DOI: 10.7270/Q2VQ336P
3D
3D Structure (crystal)
72 kDa type IV collagenase
(Homo sapiens (Human))
BDBM50104501
((R)-2-[(Formyl-hydroxy-amino)-methyl]-hexanoic aci...)
Show SMILES CCCC[C@H](CN(O)C=O)C(=O)N[C@H](C(=O)N(C)C)C(C)(C)C
Show InChI InChI=1S/C16H31N3O4/c1-7-8-9-12(10-19(23)11-20)14(21)17-13(16(2,3)4)15(22)18(5)6/h11-13,23H,7-10H2,1-6H3,(H,17,21)/t12-,13-/m1/s1
Reactome pathway
n/an/a 1.50E+4n/an/an/an/an/an/a
British Biotech Pharmaceuticals Limited
Curated by ChEMBL
Assay Description
Inhibition of Matrix metalloproteinase-2
Bioorg Med Chem Lett 11: 2585-8 (2001)
BindingDB Entry DOI: 10.7270/Q2SN0886