BDBM50104700 3-Hexadecanoyl-4-hydroxy-5H-furan-2-one::CHEMBL321386
SMILES: CCCCCCCCCCCCCCCC(=O)c1c(O)coc1O
InChI Key: InChIKey=RMBNPKHVQZHDRI-UHFFFAOYSA-N
Data: 2 IC50
Activity Spreadsheet -- Enzyme Inhibition Constant Data from BindingDB
Found 2 hits for monomerid = 50104700
Trg + Lig
Ki
nM
ΔG°
kcal/mole
IC50
nM
Kd
nM
EC50/IC50
nM
koff
s-1
kon
M-1s-1
pHTemp
°C
Dual specificity phosphatase Cdc25B
(Mus musculus)
BDBM50104700
(3-Hexadecanoyl-4-hydroxy-5H-furan-2-one | CHEMBL32...)
Show SMILES CCCCCCCCCCCCCCCC(=O)c1c(O)coc1O
Show InChI InChI=1S/C20H34O4/c1-2-3-4-5-6-7-8-9-10-11-12-13-14-15-17(21)19-18(22)16-24-20(19)23/h16,22-23H,2-15H2,1H3
Reactome pathway
n/an/a 3.00E+3n/an/an/an/an/an/a
Tohoku University
Curated by ChEMBL
Assay Description
Inhibitory activity against cell division cycle 25B
J Med Chem 44: 3216-22 (2001)
BindingDB Entry DOI: 10.7270/Q2WD3ZVR
Dual specificity protein phosphatase (VHR)
(Homo sapiens (Human))
BDBM50104700
(3-Hexadecanoyl-4-hydroxy-5H-furan-2-one | CHEMBL32...)
Show SMILES CCCCCCCCCCCCCCCC(=O)c1c(O)coc1O
Show InChI InChI=1S/C20H34O4/c1-2-3-4-5-6-7-8-9-10-11-12-13-14-15-17(21)19-18(22)16-24-20(19)23/h16,22-23H,2-15H2,1H3
Reactome pathway
n/an/a 1.44E+4n/an/an/an/an/an/a
Tohoku University
Curated by ChEMBL
Assay Description
Inhibitory activity against vaccinia VH1-related phosphatase(VHR)
J Med Chem 44: 3216-22 (2001)
BindingDB Entry DOI: 10.7270/Q2WD3ZVR