BDBM50104843 CHEMBL419578::N-[3-(3-Bromo-4-fluoro-phenyl)-2,2-dimethyl-cyclopropanecarbonyl]-guanidine
SMILES: CC1(C)[C@@H]([C@H]1c1ccc(F)c(Br)c1)C(=O)NC(N)=N
InChI Key: InChIKey=AOXSBTBCCUZZSC-ZJUUUORDSA-N
Data: 1 IC50
Activity Spreadsheet -- Enzyme Inhibition Constant Data from BindingDB
Found 1 hit for monomerid = 50104843
Trg + Lig
Ki
nM
ΔG°
kcal/mole
IC50
nM
Kd
nM
EC50/IC50
nM
koff
s-1
kon
M-1s-1
pHTemp
°C
Sodium/hydrogen exchanger 1
(Homo sapiens (Human))
BDBM50104843
(CHEMBL419578 | N-[3-(3-Bromo-4-fluoro-phenyl)-2,2-...)
Show SMILES CC1(C)[C@@H]([C@H]1c1ccc(F)c(Br)c1)C(=O)NC(N)=N
Show InChI InChI=1S/C13H15BrFN3O/c1-13(2)9(10(13)11(19)18-12(16)17)6-3-4-8(15)7(14)5-6/h3-5,9-10H,1-2H3,(H4,16,17,18,19)/t9-,10+/m1/s1
NCI pathway
Reactome pathway
n/an/a 3n/an/an/an/an/an/a
Bristol-Myers Squibb Pharmaceutical Research Institute
Curated by ChEMBL
Assay Description
Screened in AP1 cells expressing human NHE-1 for sodium hydrogen exchange activity
J Med Chem 44: 3302-10 (2001)
BindingDB Entry DOI: 10.7270/Q2H41QQ4