BDBM50104986 4-tert-Butyl-N-{5-(4-ethyl-phenyl)-6-[2-(5-methylsulfanyl-pyrimidin-2-yloxy)-ethoxy]-pyrimidin-4-yl}-benzenesulfonamide::CHEMBL332922
SMILES: CCc1ccc(cc1)-c1c(NS(=O)(=O)c2ccc(cc2)C(C)(C)C)ncnc1OCCOc1ncc(SC)cn1
InChI Key: InChIKey=DMGFBAJASZHOPO-UHFFFAOYSA-N
Data: 1 IC50
Activity Spreadsheet -- Enzyme Inhibition Constant Data from BindingDB
Found 1 hit for monomerid = 50104986
Trg + Lig
Ki
nM
ΔG°
kcal/mole
IC50
nM
Kd
nM
EC50/IC50
nM
koff
s-1
kon
M-1s-1
pHTemp
°C
Endothelin receptor ET-A
(Sus scrofa)
BDBM50104986
(4-tert-Butyl-N-{5-(4-ethyl-phenyl)-6-[2-(5-methyls...)
Show SMILES CCc1ccc(cc1)-c1c(NS(=O)(=O)c2ccc(cc2)C(C)(C)C)ncnc1OCCOc1ncc(SC)cn1
Show InChI InChI=1S/C29H33N5O4S2/c1-6-20-7-9-21(10-8-20)25-26(34-40(35,36)24-13-11-22(12-14-24)29(2,3)4)32-19-33-27(25)37-15-16-38-28-30-17-23(39-5)18-31-28/h7-14,17-19H,6,15-16H2,1-5H3,(H,32,33,34)
Reactome pathway
n/an/a 0.0130n/an/an/an/an/an/a
Tanabe Seiyaku Co., Ltd.
Curated by ChEMBL
Assay Description
In vitro inhibition of [125I]-ET-1 binding to Endothelin A receptor in porcine aortic membrane from endothelial cells
J Med Chem 44: 3355-68 (2001)
BindingDB Entry DOI: 10.7270/Q2QN662B