BDBM50105025 4-tert-Butyl-N-{5-(3-methoxy-phenyl)-6-[2-(5-methylsulfanyl-pyrimidin-2-yloxy)-ethoxy]-pyrimidin-4-yl}-benzenesulfonamide::CHEMBL115333
SMILES: COc1cccc(c1)-c1c(NS(=O)(=O)c2ccc(cc2)C(C)(C)C)ncnc1OCCOc1ncc(SC)cn1
InChI Key: InChIKey=YURRIZBVTADDTL-UHFFFAOYSA-N
Data: 1 IC50
Activity Spreadsheet -- Enzyme Inhibition Constant Data from BindingDB
Found 1 hit for monomerid = 50105025
Trg + Lig
Ki
nM
ΔG°
kcal/mole
IC50
nM
Kd
nM
EC50/IC50
nM
koff
s-1
kon
M-1s-1
pHTemp
°C
Endothelin receptor ET-A
(Sus scrofa)
BDBM50105025
(4-tert-Butyl-N-{5-(3-methoxy-phenyl)-6-[2-(5-methy...)
Show SMILES COc1cccc(c1)-c1c(NS(=O)(=O)c2ccc(cc2)C(C)(C)C)ncnc1OCCOc1ncc(SC)cn1
Show InChI InChI=1S/C28H31N5O5S2/c1-28(2,3)20-9-11-23(12-10-20)40(34,35)33-25-24(19-7-6-8-21(15-19)36-4)26(32-18-31-25)37-13-14-38-27-29-16-22(39-5)17-30-27/h6-12,15-18H,13-14H2,1-5H3,(H,31,32,33)
Reactome pathway
n/an/a 0.0280n/an/an/an/an/an/a
Tanabe Seiyaku Co., Ltd.
Curated by ChEMBL
Assay Description
In vitro inhibition of [125I]-ET-1 binding to Endothelin A receptor in porcine aortic membrane from endothelial cells
J Med Chem 44: 3355-68 (2001)
BindingDB Entry DOI: 10.7270/Q2QN662B