BDBM50105033 CHEMBL112531::N-{6-[2-(5-Bromo-pyrimidin-2-yloxy)-ethoxy]-5-p-tolyl-pyrimidin-4-yl}-4-tert-butyl-benzenesulfonamide
SMILES: Cc1ccc(cc1)-c1c(NS(=O)(=O)c2ccc(cc2)C(C)(C)C)ncnc1OCCOc1ncc(Br)cn1
InChI Key: InChIKey=XCDYCRJUBJSYLD-UHFFFAOYSA-N
Data: 2 KI  3 IC50
Activity Spreadsheet -- Enzyme Inhibition Constant Data from BindingDB
Found 5 hits for monomerid = 50105033
Trg + Lig
Ki
nM
ΔG°
kcal/mole
IC50
nM
Kd
nM
EC50/IC50
nM
koff
s-1
kon
M-1s-1
pHTemp
°C
Endothelin-1 receptor
(Homo sapiens (Human))
BDBM50105033
(CHEMBL112531 | N-{6-[2-(5-Bromo-pyrimidin-2-yloxy)...)
Show SMILES Cc1ccc(cc1)-c1c(NS(=O)(=O)c2ccc(cc2)C(C)(C)C)ncnc1OCCOc1ncc(Br)cn1
Show InChI InChI=1S/C27H28BrN5O4S/c1-18-5-7-19(8-6-18)23-24(33-38(34,35)22-11-9-20(10-12-22)27(2,3)4)31-17-32-25(23)36-13-14-37-26-29-15-21(28)16-30-26/h5-12,15-17H,13-14H2,1-4H3,(H,31,32,33)
0.00420n/an/an/an/an/an/an/an/a
Tanabe Seiyaku Co., Ltd.
Curated by ChEMBL
Assay Description
Ability to inhibit [125I]ET1 binding to human cloned endothelin A receptor expressed on CHO cells
J Med Chem 44: 3369-77 (2001)
BindingDB Entry DOI: 10.7270/Q27M08P8
EDNRB
(Homo sapiens (Human))
BDBM50105033
(CHEMBL112531 | N-{6-[2-(5-Bromo-pyrimidin-2-yloxy)...)
Show SMILES Cc1ccc(cc1)-c1c(NS(=O)(=O)c2ccc(cc2)C(C)(C)C)ncnc1OCCOc1ncc(Br)cn1
Show InChI InChI=1S/C27H28BrN5O4S/c1-18-5-7-19(8-6-18)23-24(33-38(34,35)22-11-9-20(10-12-22)27(2,3)4)31-17-32-25(23)36-13-14-37-26-29-15-21(28)16-30-26/h5-12,15-17H,13-14H2,1-4H3,(H,31,32,33)
130n/an/an/an/an/an/an/an/a
Tanabe Seiyaku Co., Ltd.
Curated by ChEMBL
Assay Description
Ability to inhibit [125I]-ET-1 binding to human cloned ETB receptors expressed on CHO cells
J Med Chem 44: 3369-77 (2001)
BindingDB Entry DOI: 10.7270/Q27M08P8
EDNRB
(Homo sapiens (Human))
BDBM50105033
(CHEMBL112531 | N-{6-[2-(5-Bromo-pyrimidin-2-yloxy)...)
Show SMILES Cc1ccc(cc1)-c1c(NS(=O)(=O)c2ccc(cc2)C(C)(C)C)ncnc1OCCOc1ncc(Br)cn1
Show InChI InChI=1S/C27H28BrN5O4S/c1-18-5-7-19(8-6-18)23-24(33-38(34,35)22-11-9-20(10-12-22)27(2,3)4)31-17-32-25(23)36-13-14-37-26-29-15-21(28)16-30-26/h5-12,15-17H,13-14H2,1-4H3,(H,31,32,33)
n/an/a 38n/an/an/an/an/an/a
Tanabe Seiyaku Co., Ltd.
Curated by ChEMBL
Assay Description
Ability to inhibit specific binding of [125I]- -ET-1 to human GH cells which express endothelin B receptor
J Med Chem 44: 3369-77 (2001)
BindingDB Entry DOI: 10.7270/Q27M08P8
Endothelin receptor ET-A
(Sus scrofa)
BDBM50105033
(CHEMBL112531 | N-{6-[2-(5-Bromo-pyrimidin-2-yloxy)...)
Show SMILES Cc1ccc(cc1)-c1c(NS(=O)(=O)c2ccc(cc2)C(C)(C)C)ncnc1OCCOc1ncc(Br)cn1
Show InChI InChI=1S/C27H28BrN5O4S/c1-18-5-7-19(8-6-18)23-24(33-38(34,35)22-11-9-20(10-12-22)27(2,3)4)31-17-32-25(23)36-13-14-37-26-29-15-21(28)16-30-26/h5-12,15-17H,13-14H2,1-4H3,(H,31,32,33)
Reactome pathway
n/an/a<0.00100n/an/an/an/an/an/a
Tanabe Seiyaku Co. Ltd.
Curated by ChEMBL
Assay Description
In vitro inhibition of [125 I]ET-1 binding to Endothelin A receptor in porcine aortic membrane.
Bioorg Med Chem Lett 12: 81-4 (2001)
BindingDB Entry DOI: 10.7270/Q2VX0FSC
EDNRA
(RAT)
BDBM50105033
(CHEMBL112531 | N-{6-[2-(5-Bromo-pyrimidin-2-yloxy)...)
Show SMILES Cc1ccc(cc1)-c1c(NS(=O)(=O)c2ccc(cc2)C(C)(C)C)ncnc1OCCOc1ncc(Br)cn1
Show InChI InChI=1S/C27H28BrN5O4S/c1-18-5-7-19(8-6-18)23-24(33-38(34,35)22-11-9-20(10-12-22)27(2,3)4)31-17-32-25(23)36-13-14-37-26-29-15-21(28)16-30-26/h5-12,15-17H,13-14H2,1-4H3,(H,31,32,33)
Reactome pathway
n/an/a 0.0390n/an/an/an/an/an/a
Tanabe Seiyaku Co., Ltd.
Curated by ChEMBL
Assay Description
Ability to inhibit specific binding of [125I]- -ET-1 to rat A 10 cells which express endothelin A receptor
J Med Chem 44: 3369-77 (2001)
BindingDB Entry DOI: 10.7270/Q27M08P8