BDBM50105048 CHEMBL112144::N-[6-[2-(5-Bromo-pyrimidin-2-yloxy)-ethoxy]-5-(2-methoxy-phenoxy)-pyrimidin-4-yl]-4-tert-butyl-benzenesulfonamide
SMILES: COc1ccccc1Oc1c(NS(=O)(=O)c2ccc(cc2)C(C)(C)C)ncnc1OCCOc1ncc(Br)cn1
InChI Key: InChIKey=SCOSJTHYNURMHO-UHFFFAOYSA-N
Data: 3 IC50
Activity Spreadsheet -- Enzyme Inhibition Constant Data from BindingDB
Found 3 hits for monomerid = 50105048
Trg + Lig
Ki
nM
ΔG°
kcal/mole
IC50
nM
Kd
nM
EC50/IC50
nM
koff
s-1
kon
M-1s-1
pHTemp
°C
Endothelin receptor ET-A
(Sus scrofa)
BDBM50105048
(CHEMBL112144 | N-[6-[2-(5-Bromo-pyrimidin-2-yloxy)...)
Show SMILES COc1ccccc1Oc1c(NS(=O)(=O)c2ccc(cc2)C(C)(C)C)ncnc1OCCOc1ncc(Br)cn1
Show InChI InChI=1S/C27H28BrN5O6S/c1-27(2,3)18-9-11-20(12-10-18)40(34,35)33-24-23(39-22-8-6-5-7-21(22)36-4)25(32-17-31-24)37-13-14-38-26-29-15-19(28)16-30-26/h5-12,15-17H,13-14H2,1-4H3,(H,31,32,33)
Reactome pathway
n/an/a 0.00390n/an/an/an/an/an/a
Tanabe Seiyaku Co., Ltd.
Curated by ChEMBL
Assay Description
In vitro inhibition of [125I]-ET-1 binding to Endothelin A receptor in porcine aortic membrane from endothelial cells
J Med Chem 44: 3355-68 (2001)
BindingDB Entry DOI: 10.7270/Q2QN662B
EDNRB
(RAT)
BDBM50105048
(CHEMBL112144 | N-[6-[2-(5-Bromo-pyrimidin-2-yloxy)...)
Show SMILES COc1ccccc1Oc1c(NS(=O)(=O)c2ccc(cc2)C(C)(C)C)ncnc1OCCOc1ncc(Br)cn1
Show InChI InChI=1S/C27H28BrN5O6S/c1-27(2,3)18-9-11-20(12-10-18)40(34,35)33-24-23(39-22-8-6-5-7-21(22)36-4)25(32-17-31-24)37-13-14-38-26-29-15-19(28)16-30-26/h5-12,15-17H,13-14H2,1-4H3,(H,31,32,33)
Reactome pathway
n/an/a>1n/an/an/an/an/an/a
Tanabe Seiyaku Co. Ltd.
Curated by ChEMBL
Assay Description
In vitro inhibition of [125 I]ET-1 binding to Endothelin B receptor (ETB-receptor) in rat cerebellum membranes
Bioorg Med Chem Lett 12: 81-4 (2001)
BindingDB Entry DOI: 10.7270/Q2VX0FSC
Endothelin receptor ET-A
(Sus scrofa)
BDBM50105048
(CHEMBL112144 | N-[6-[2-(5-Bromo-pyrimidin-2-yloxy)...)
Show SMILES COc1ccccc1Oc1c(NS(=O)(=O)c2ccc(cc2)C(C)(C)C)ncnc1OCCOc1ncc(Br)cn1
Show InChI InChI=1S/C27H28BrN5O6S/c1-27(2,3)18-9-11-20(12-10-18)40(34,35)33-24-23(39-22-8-6-5-7-21(22)36-4)25(32-17-31-24)37-13-14-38-26-29-15-19(28)16-30-26/h5-12,15-17H,13-14H2,1-4H3,(H,31,32,33)
Reactome pathway
n/an/a 0.00390n/an/an/an/an/an/a
Tanabe Seiyaku Co. Ltd.
Curated by ChEMBL
Assay Description
In vitro inhibition of [125 I]ET-1 binding to Endothelin A receptor in porcine aortic membrane.
Bioorg Med Chem Lett 12: 81-4 (2001)
BindingDB Entry DOI: 10.7270/Q2VX0FSC