BDBM50105054 4-tert-Butyl-N-{5-(4-hydroxymethyl-phenyl)-6-[2-(5-methylsulfanyl-pyrimidin-2-yloxy)-ethoxy]-pyrimidin-4-yl}-benzenesulfonamide::CHEMBL114298
SMILES: CSc1cnc(OCCOc2ncnc(NS(=O)(=O)c3ccc(cc3)C(C)(C)C)c2-c2ccc(CO)cc2)nc1
InChI Key: InChIKey=IEILUJOEUXJRSC-UHFFFAOYSA-N
Data: 1 IC50
Activity Spreadsheet -- Enzyme Inhibition Constant Data from BindingDB
Found 1 hit for monomerid = 50105054
Trg + Lig
Ki
nM
ΔG°
kcal/mole
IC50
nM
Kd
nM
EC50/IC50
nM
koff
s-1
kon
M-1s-1
pHTemp
°C
Endothelin receptor ET-A
(Sus scrofa)
BDBM50105054
(4-tert-Butyl-N-{5-(4-hydroxymethyl-phenyl)-6-[2-(5...)
Show SMILES CSc1cnc(OCCOc2ncnc(NS(=O)(=O)c3ccc(cc3)C(C)(C)C)c2-c2ccc(CO)cc2)nc1
Show InChI InChI=1S/C28H31N5O5S2/c1-28(2,3)21-9-11-23(12-10-21)40(35,36)33-25-24(20-7-5-19(17-34)6-8-20)26(32-18-31-25)37-13-14-38-27-29-15-22(39-4)16-30-27/h5-12,15-16,18,34H,13-14,17H2,1-4H3,(H,31,32,33)
Reactome pathway
n/an/a 0.0400n/an/an/an/an/an/a
Tanabe Seiyaku Co., Ltd.
Curated by ChEMBL
Assay Description
Ability to inhibit [125I]ET1 binding to endothelin A receptor in porcine aortic membrane
J Med Chem 44: 3369-77 (2001)
BindingDB Entry DOI: 10.7270/Q27M08P8