null
SMILES: [O-][N+](=O)c1cc2OCOc2cc1COC(=O)N1CCC2(CC1)N(CNC2=O)c1ccccc1
InChI Key: InChIKey=IYMOEEOAMDVNPW-UHFFFAOYSA-N
Activity Spreadsheet -- Enzyme Inhibition Constant Data from BindingDB
Found 4 hits for monomerid = 50105082
Trg + Lig
Ki
nM
ΔG°
kcal/mole
IC50
nM
Kd
nM
EC50/IC50
nM
koff
s-1
kon
M-1s-1
pHTemp
°C
Delta-type opioid receptor
(Homo sapiens (Human))
BDBM50105082
(4-Oxo-1-phenyl-1,3,8-triaza-spiro[4.5]decane-8-car...)
Show SMILES [O-][N+](=O)c1cc2OCOc2cc1COC(=O)N1CCC2(CC1)N(CNC2=O)c1ccccc1
Show InChI InChI=1S/C22H22N4O7/c27-20-22(25(13-23-20)16-4-2-1-3-5-16)6-8-24(9-7-22)21(28)31-12-15-10-18-19(33-14-32-18)11-17(15)26(29)30/h1-5,10-11H,6-9,12-14H2,(H,23,27)
Reactome pathway
n/an/a>1.00E+4n/an/an/an/an/an/a
F-59000 Lille
Curated by ChEMBL
Assay Description
Binding affinity against delta-opiate receptor (human) using [3H]-DPDPE radioligand
J Med Chem 44: 3378-90 (2001)
BindingDB Entry DOI: 10.7270/Q23X87B8
Kappa-type opioid receptor
(Homo sapiens (Human))
BDBM50105082
(4-Oxo-1-phenyl-1,3,8-triaza-spiro[4.5]decane-8-car...)
Show SMILES [O-][N+](=O)c1cc2OCOc2cc1COC(=O)N1CCC2(CC1)N(CNC2=O)c1ccccc1
Show InChI InChI=1S/C22H22N4O7/c27-20-22(25(13-23-20)16-4-2-1-3-5-16)6-8-24(9-7-22)21(28)31-12-15-10-18-19(33-14-32-18)11-17(15)26(29)30/h1-5,10-11H,6-9,12-14H2,(H,23,27)
Reactome pathway
n/an/a 5.07E+3n/an/an/an/an/an/a
F-59000 Lille
Curated by ChEMBL
Assay Description
Binding affinity against opioid receptor kappa 1 by using [3H]U-69593 as radioligand
J Med Chem 44: 3391-401 (2001)
BindingDB Entry DOI: 10.7270/Q2057GN9
Kappa-type opioid receptor
(Homo sapiens (Human))
BDBM50105082
(4-Oxo-1-phenyl-1,3,8-triaza-spiro[4.5]decane-8-car...)
Show SMILES [O-][N+](=O)c1cc2OCOc2cc1COC(=O)N1CCC2(CC1)N(CNC2=O)c1ccccc1
Show InChI InChI=1S/C22H22N4O7/c27-20-22(25(13-23-20)16-4-2-1-3-5-16)6-8-24(9-7-22)21(28)31-12-15-10-18-19(33-14-32-18)11-17(15)26(29)30/h1-5,10-11H,6-9,12-14H2,(H,23,27)
Reactome pathway
n/an/a 5.07E+3n/an/an/an/an/an/a
F-59000 Lille
Curated by ChEMBL
Assay Description
Binding affinity against opioid receptor kappa 1 using [3H]- U-69,593 radioligand
J Med Chem 44: 3378-90 (2001)
BindingDB Entry DOI: 10.7270/Q23X87B8
Mu-type opioid receptor
(Homo sapiens (Human))
BDBM50105082
(4-Oxo-1-phenyl-1,3,8-triaza-spiro[4.5]decane-8-car...)
Show SMILES [O-][N+](=O)c1cc2OCOc2cc1COC(=O)N1CCC2(CC1)N(CNC2=O)c1ccccc1
Show InChI InChI=1S/C22H22N4O7/c27-20-22(25(13-23-20)16-4-2-1-3-5-16)6-8-24(9-7-22)21(28)31-12-15-10-18-19(33-14-32-18)11-17(15)26(29)30/h1-5,10-11H,6-9,12-14H2,(H,23,27)
NCI pathway
Reactome pathway
n/an/a>1.00E+4n/an/an/an/an/an/a
F-59000 Lille
Curated by ChEMBL
Assay Description
Binding affinity against mu-opiate receptor (human) using [3H]DAMGO radioligand
J Med Chem 44: 3378-90 (2001)
BindingDB Entry DOI: 10.7270/Q23X87B8