null
SMILES: Cc1ncc(n1CCNC(=O)N1CCC(CC1)c1cc(n[nH]1)-c1ccc(Cl)cc1Cl)[N+]([O-])=O
InChI Key: InChIKey=HISHPKCGBGQDHI-UHFFFAOYSA-N
Activity Spreadsheet -- Enzyme Inhibition Constant Data from BindingDB
Found 5 hits for monomerid = 50105100
Trg + Lig
Ki
nM
ΔG°
kcal/mole
IC50
nM
Kd
nM
EC50/IC50
nM
koff
s-1
kon
M-1s-1
pHTemp
°C
Delta-type opioid receptor
(Homo sapiens (Human))
BDBM50105100
(4-[5-(2,4-Dichloro-phenyl)-2H-pyrazol-3-yl]-piperi...)
Show SMILES Cc1ncc(n1CCNC(=O)N1CCC(CC1)c1cc(n[nH]1)-c1ccc(Cl)cc1Cl)[N+]([O-])=O
Show InChI InChI=1S/C21H23Cl2N7O3/c1-13-25-12-20(30(32)33)29(13)9-6-24-21(31)28-7-4-14(5-8-28)18-11-19(27-26-18)16-3-2-15(22)10-17(16)23/h2-3,10-12,14H,4-9H2,1H3,(H,24,31)(H,26,27)
Reactome pathway
n/an/a 7.13E+3n/an/an/an/an/an/a
F-59000 Lille
Curated by ChEMBL
Assay Description
Inhibition of ligand binding to human delta opioid receptor.
J Med Chem 44: 3391-401 (2001)
BindingDB Entry DOI: 10.7270/Q2057GN9
Delta-type opioid receptor
(Homo sapiens (Human))
BDBM50105100
(4-[5-(2,4-Dichloro-phenyl)-2H-pyrazol-3-yl]-piperi...)
Show SMILES Cc1ncc(n1CCNC(=O)N1CCC(CC1)c1cc(n[nH]1)-c1ccc(Cl)cc1Cl)[N+]([O-])=O
Show InChI InChI=1S/C21H23Cl2N7O3/c1-13-25-12-20(30(32)33)29(13)9-6-24-21(31)28-7-4-14(5-8-28)18-11-19(27-26-18)16-3-2-15(22)10-17(16)23/h2-3,10-12,14H,4-9H2,1H3,(H,24,31)(H,26,27)
Reactome pathway
n/an/a 7.13E+3n/an/an/an/an/an/a
F-59000 Lille
Curated by ChEMBL
Assay Description
Binding affinity against delta-opiate receptor (human) using [3H]-DPDPE radioligand
J Med Chem 44: 3378-90 (2001)
BindingDB Entry DOI: 10.7270/Q23X87B8
Mu-type opioid receptor
(Homo sapiens (Human))
BDBM50105100
(4-[5-(2,4-Dichloro-phenyl)-2H-pyrazol-3-yl]-piperi...)
Show SMILES Cc1ncc(n1CCNC(=O)N1CCC(CC1)c1cc(n[nH]1)-c1ccc(Cl)cc1Cl)[N+]([O-])=O
Show InChI InChI=1S/C21H23Cl2N7O3/c1-13-25-12-20(30(32)33)29(13)9-6-24-21(31)28-7-4-14(5-8-28)18-11-19(27-26-18)16-3-2-15(22)10-17(16)23/h2-3,10-12,14H,4-9H2,1H3,(H,24,31)(H,26,27)
NCI pathway
Reactome pathway
n/an/a 2.89E+3n/an/an/an/an/an/a
F-59000 Lille
Curated by ChEMBL
Assay Description
Binding affinity against mu opiate receptor
J Med Chem 44: 3391-401 (2001)
BindingDB Entry DOI: 10.7270/Q2057GN9
Kappa-type opioid receptor
(Homo sapiens (Human))
BDBM50105100
(4-[5-(2,4-Dichloro-phenyl)-2H-pyrazol-3-yl]-piperi...)
Show SMILES Cc1ncc(n1CCNC(=O)N1CCC(CC1)c1cc(n[nH]1)-c1ccc(Cl)cc1Cl)[N+]([O-])=O
Show InChI InChI=1S/C21H23Cl2N7O3/c1-13-25-12-20(30(32)33)29(13)9-6-24-21(31)28-7-4-14(5-8-28)18-11-19(27-26-18)16-3-2-15(22)10-17(16)23/h2-3,10-12,14H,4-9H2,1H3,(H,24,31)(H,26,27)
Reactome pathway
n/an/a>1.00E+4n/an/an/an/an/an/a
F-59000 Lille
Curated by ChEMBL
Assay Description
Binding affinity against opioid receptor kappa 1 using [3H]- U-69,593 radioligand
J Med Chem 44: 3378-90 (2001)
BindingDB Entry DOI: 10.7270/Q23X87B8
Mu-type opioid receptor
(Homo sapiens (Human))
BDBM50105100
(4-[5-(2,4-Dichloro-phenyl)-2H-pyrazol-3-yl]-piperi...)
Show SMILES Cc1ncc(n1CCNC(=O)N1CCC(CC1)c1cc(n[nH]1)-c1ccc(Cl)cc1Cl)[N+]([O-])=O
Show InChI InChI=1S/C21H23Cl2N7O3/c1-13-25-12-20(30(32)33)29(13)9-6-24-21(31)28-7-4-14(5-8-28)18-11-19(27-26-18)16-3-2-15(22)10-17(16)23/h2-3,10-12,14H,4-9H2,1H3,(H,24,31)(H,26,27)
NCI pathway
Reactome pathway
n/an/a 2.89E+3n/an/an/an/an/an/a
F-59000 Lille
Curated by ChEMBL
Assay Description
Binding affinity against mu-opiate receptor (human) using [3H]DAMGO radioligand
J Med Chem 44: 3378-90 (2001)
BindingDB Entry DOI: 10.7270/Q23X87B8