BDBM50105106 1-[1-(2-Chloro-4-methyl-benzyl)-piperidin-4-yl]-1,3-dihydro-benzoimidazol-2-one::CHEMBL114484
SMILES: Cc1ccc(CN2CCC(CC2)n2c3ccccc3[nH]c2=O)c(Cl)c1
InChI Key: InChIKey=KTQASNDGWLUTPN-UHFFFAOYSA-N
Data: 13 IC50
Activity Spreadsheet -- Enzyme Inhibition Constant Data from BindingDB
Found 13 hits for monomerid = 50105106
Trg + Lig
Ki
nM
ΔG°
kcal/mole
IC50
nM
Kd
nM
EC50/IC50
nM
koff
s-1
kon
M-1s-1
pHTemp
°C
Voltage-gated L-type calcium channel
(Homo sapiens (Human))
BDBM50105106
(1-[1-(2-Chloro-4-methyl-benzyl)-piperidin-4-yl]-1,...)
Show SMILES Cc1ccc(CN2CCC(CC2)n2c3ccccc3[nH]c2=O)c(Cl)c1
Show InChI InChI=1S/C20H22ClN3O/c1-14-6-7-15(17(21)12-14)13-23-10-8-16(9-11-23)24-19-5-3-2-4-18(19)22-20(24)25/h2-7,12,16H,8-11,13H2,1H3,(H,22,25)
n/an/a 1.34E+3n/an/an/an/an/an/a
F-59000 Lille
Curated by ChEMBL
Assay Description
Binding affinity against L-type calcium channel verapamil site
J Med Chem 44: 3391-401 (2001)
BindingDB Entry DOI: 10.7270/Q2057GN9
Delta-type opioid receptor
(Homo sapiens (Human))
BDBM50105106
(1-[1-(2-Chloro-4-methyl-benzyl)-piperidin-4-yl]-1,...)
Show SMILES Cc1ccc(CN2CCC(CC2)n2c3ccccc3[nH]c2=O)c(Cl)c1
Show InChI InChI=1S/C20H22ClN3O/c1-14-6-7-15(17(21)12-14)13-23-10-8-16(9-11-23)24-19-5-3-2-4-18(19)22-20(24)25/h2-7,12,16H,8-11,13H2,1H3,(H,22,25)
Reactome pathway
n/an/a 1.41E+3n/an/an/an/an/an/a
F-59000 Lille
Curated by ChEMBL
Assay Description
Inhibition of ligand binding to human delta opioid receptor.
J Med Chem 44: 3391-401 (2001)
BindingDB Entry DOI: 10.7270/Q2057GN9
Adrenergic receptor alpha-1
(Homo sapiens (Human))
BDBM50105106
(1-[1-(2-Chloro-4-methyl-benzyl)-piperidin-4-yl]-1,...)
Show SMILES Cc1ccc(CN2CCC(CC2)n2c3ccccc3[nH]c2=O)c(Cl)c1
Show InChI InChI=1S/C20H22ClN3O/c1-14-6-7-15(17(21)12-14)13-23-10-8-16(9-11-23)24-19-5-3-2-4-18(19)22-20(24)25/h2-7,12,16H,8-11,13H2,1H3,(H,22,25)
n/an/a 1.15E+3n/an/an/an/an/an/a
F-59000 Lille
Curated by ChEMBL
Assay Description
Inhibition of alpha-1 adrenergic receptor
J Med Chem 44: 3391-401 (2001)
BindingDB Entry DOI: 10.7270/Q2057GN9
D(2) dopamine receptor
(Homo sapiens (Human))
BDBM50105106
(1-[1-(2-Chloro-4-methyl-benzyl)-piperidin-4-yl]-1,...)
Show SMILES Cc1ccc(CN2CCC(CC2)n2c3ccccc3[nH]c2=O)c(Cl)c1
Show InChI InChI=1S/C20H22ClN3O/c1-14-6-7-15(17(21)12-14)13-23-10-8-16(9-11-23)24-19-5-3-2-4-18(19)22-20(24)25/h2-7,12,16H,8-11,13H2,1H3,(H,22,25)
Reactome pathway
n/an/a 480n/an/an/an/an/an/a
F-59000 Lille
Curated by ChEMBL
Assay Description
Inhibition of human dopamine receptor D2
J Med Chem 44: 3391-401 (2001)
BindingDB Entry DOI: 10.7270/Q2057GN9
Muscarinic acetylcholine receptor M2
(Homo sapiens (Human))
BDBM50105106
(1-[1-(2-Chloro-4-methyl-benzyl)-piperidin-4-yl]-1,...)
Show SMILES Cc1ccc(CN2CCC(CC2)n2c3ccccc3[nH]c2=O)c(Cl)c1
Show InChI InChI=1S/C20H22ClN3O/c1-14-6-7-15(17(21)12-14)13-23-10-8-16(9-11-23)24-19-5-3-2-4-18(19)22-20(24)25/h2-7,12,16H,8-11,13H2,1H3,(H,22,25)
n/an/a 1.57E+3n/an/an/an/an/an/a
F-59000 Lille
Curated by ChEMBL
Assay Description
Binding affinity against muscarinic acetylcholine receptor M2
J Med Chem 44: 3391-401 (2001)
BindingDB Entry DOI: 10.7270/Q2057GN9
D(3) dopamine receptor
(Homo sapiens (Human))
BDBM50105106
(1-[1-(2-Chloro-4-methyl-benzyl)-piperidin-4-yl]-1,...)
Show SMILES Cc1ccc(CN2CCC(CC2)n2c3ccccc3[nH]c2=O)c(Cl)c1
Show InChI InChI=1S/C20H22ClN3O/c1-14-6-7-15(17(21)12-14)13-23-10-8-16(9-11-23)24-19-5-3-2-4-18(19)22-20(24)25/h2-7,12,16H,8-11,13H2,1H3,(H,22,25)
n/an/a 154n/an/an/an/an/an/a
F-59000 Lille
Curated by ChEMBL
Assay Description
Inhibition of human dopamine receptor D3
J Med Chem 44: 3391-401 (2001)
BindingDB Entry DOI: 10.7270/Q2057GN9
Mu-type opioid receptor
(Homo sapiens (Human))
BDBM50105106
(1-[1-(2-Chloro-4-methyl-benzyl)-piperidin-4-yl]-1,...)
Show SMILES Cc1ccc(CN2CCC(CC2)n2c3ccccc3[nH]c2=O)c(Cl)c1
Show InChI InChI=1S/C20H22ClN3O/c1-14-6-7-15(17(21)12-14)13-23-10-8-16(9-11-23)24-19-5-3-2-4-18(19)22-20(24)25/h2-7,12,16H,8-11,13H2,1H3,(H,22,25)
NCI pathway
Reactome pathway
n/an/a 16n/an/an/an/an/an/a
F-59000 Lille
Curated by ChEMBL
Assay Description
Binding affinity against mu opiate receptor
J Med Chem 44: 3391-401 (2001)
BindingDB Entry DOI: 10.7270/Q2057GN9
Muscarinic acetylcholine receptor M1
(Homo sapiens (Human))
BDBM50105106
(1-[1-(2-Chloro-4-methyl-benzyl)-piperidin-4-yl]-1,...)
Show SMILES Cc1ccc(CN2CCC(CC2)n2c3ccccc3[nH]c2=O)c(Cl)c1
Show InChI InChI=1S/C20H22ClN3O/c1-14-6-7-15(17(21)12-14)13-23-10-8-16(9-11-23)24-19-5-3-2-4-18(19)22-20(24)25/h2-7,12,16H,8-11,13H2,1H3,(H,22,25)
n/an/a 1.78E+3n/an/an/an/an/an/a
F-59000 Lille
Curated by ChEMBL
Assay Description
Binding affinity against M1 muscarinic receptor
J Med Chem 44: 3391-401 (2001)
BindingDB Entry DOI: 10.7270/Q2057GN9
5-hydroxytryptamine receptor 7
(Homo sapiens (Human))
BDBM50105106
(1-[1-(2-Chloro-4-methyl-benzyl)-piperidin-4-yl]-1,...)
Show SMILES Cc1ccc(CN2CCC(CC2)n2c3ccccc3[nH]c2=O)c(Cl)c1
Show InChI InChI=1S/C20H22ClN3O/c1-14-6-7-15(17(21)12-14)13-23-10-8-16(9-11-23)24-19-5-3-2-4-18(19)22-20(24)25/h2-7,12,16H,8-11,13H2,1H3,(H,22,25)
Reactome pathway
n/an/a 849n/an/an/an/an/an/a
F-59000 Lille
Curated by ChEMBL
Assay Description
Inhibition of human 5-hydroxytryptamine 7 receptor
J Med Chem 44: 3391-401 (2001)
BindingDB Entry DOI: 10.7270/Q2057GN9
Nociceptin receptor
(Homo sapiens (Human))
BDBM50105106
(1-[1-(2-Chloro-4-methyl-benzyl)-piperidin-4-yl]-1,...)
Show SMILES Cc1ccc(CN2CCC(CC2)n2c3ccccc3[nH]c2=O)c(Cl)c1
Show InChI InChI=1S/C20H22ClN3O/c1-14-6-7-15(17(21)12-14)13-23-10-8-16(9-11-23)24-19-5-3-2-4-18(19)22-20(24)25/h2-7,12,16H,8-11,13H2,1H3,(H,22,25)
Reactome pathway
n/an/a 1.91E+3n/an/an/an/an/an/a
F-59000 Lille
Curated by ChEMBL
Assay Description
Inhibition of human ORL1 orphanin receptor
J Med Chem 44: 3391-401 (2001)
BindingDB Entry DOI: 10.7270/Q2057GN9
Kappa-type opioid receptor
(Homo sapiens (Human))
BDBM50105106
(1-[1-(2-Chloro-4-methyl-benzyl)-piperidin-4-yl]-1,...)
Show SMILES Cc1ccc(CN2CCC(CC2)n2c3ccccc3[nH]c2=O)c(Cl)c1
Show InChI InChI=1S/C20H22ClN3O/c1-14-6-7-15(17(21)12-14)13-23-10-8-16(9-11-23)24-19-5-3-2-4-18(19)22-20(24)25/h2-7,12,16H,8-11,13H2,1H3,(H,22,25)
Reactome pathway
n/an/a 270n/an/an/an/an/an/a
F-59000 Lille
Curated by ChEMBL
Assay Description
Binding affinity against opioid receptor kappa 1 by using [3H]U-69593 as radioligand
J Med Chem 44: 3391-401 (2001)
BindingDB Entry DOI: 10.7270/Q2057GN9
D(4) dopamine receptor
(Homo sapiens (Human))
BDBM50105106
(1-[1-(2-Chloro-4-methyl-benzyl)-piperidin-4-yl]-1,...)
Show SMILES Cc1ccc(CN2CCC(CC2)n2c3ccccc3[nH]c2=O)c(Cl)c1
Show InChI InChI=1S/C20H22ClN3O/c1-14-6-7-15(17(21)12-14)13-23-10-8-16(9-11-23)24-19-5-3-2-4-18(19)22-20(24)25/h2-7,12,16H,8-11,13H2,1H3,(H,22,25)
Reactome pathway
n/an/a 1.69E+3n/an/an/an/an/an/a
F-59000 Lille
Curated by ChEMBL
Assay Description
Inhibition of human dopamine receptor D4.4
J Med Chem 44: 3391-401 (2001)
BindingDB Entry DOI: 10.7270/Q2057GN9
D(1A) dopamine receptor
(Homo sapiens (Human))
BDBM50105106
(1-[1-(2-Chloro-4-methyl-benzyl)-piperidin-4-yl]-1,...)
Show SMILES Cc1ccc(CN2CCC(CC2)n2c3ccccc3[nH]c2=O)c(Cl)c1
Show InChI InChI=1S/C20H22ClN3O/c1-14-6-7-15(17(21)12-14)13-23-10-8-16(9-11-23)24-19-5-3-2-4-18(19)22-20(24)25/h2-7,12,16H,8-11,13H2,1H3,(H,22,25)
n/an/a 2.74E+3n/an/an/an/an/an/a
F-59000 Lille
Curated by ChEMBL
Assay Description
Inhibition of human dopamine receptor D1
J Med Chem 44: 3391-401 (2001)
BindingDB Entry DOI: 10.7270/Q2057GN9