BDBM50105371 (S)-2-{[(S)-1-(3,5-Dichloro-benzenesulfonyl)-2-methyl-pyrrolidine-2-carbonyl]-amino}-3-(2'-fluoro-biphenyl-4-yl)-propionic acid::CHEMBL93700
SMILES: C[C@]1(CCCN1S(=O)(=O)c1cc(Cl)cc(Cl)c1)C(=O)N[C@@H](Cc1ccc(cc1)-c1ccccc1F)C(O)=O
InChI Key: InChIKey=QLSFJHYLUVSHEA-IGKIAQTJSA-N
Data: 2 IC50
Activity Spreadsheet -- Enzyme Inhibition Constant Data from BindingDB
Found 2 hits for monomerid = 50105371
Trg + Lig
Ki
nM
ΔG°
kcal/mole
IC50
nM
Kd
nM
EC50/IC50
nM
koff
s-1
kon
M-1s-1
pHTemp
°C
Fibronectin receptor beta/Integrin alpha-4
(Homo sapiens (Human))
BDBM50105371
((S)-2-{[(S)-1-(3,5-Dichloro-benzenesulfonyl)-2-met...)
Show SMILES C[C@]1(CCCN1S(=O)(=O)c1cc(Cl)cc(Cl)c1)C(=O)N[C@@H](Cc1ccc(cc1)-c1ccccc1F)C(O)=O
Show InChI InChI=1S/C27H25Cl2FN2O5S/c1-27(11-4-12-32(27)38(36,37)21-15-19(28)14-20(29)16-21)26(35)31-24(25(33)34)13-17-7-9-18(10-8-17)22-5-2-3-6-23(22)30/h2-3,5-10,14-16,24H,4,11-13H2,1H3,(H,31,35)(H,33,34)/t24-,27-/m0/s1
Reactome pathway
n/an/a 2.40n/an/an/an/an/an/a
Merck Research Laboratories
Curated by ChEMBL
Assay Description
Antagonistic activity against VLA-4 integrin of human jurkat cells using [125I]VCAM-Ig as radioligand
Bioorg Med Chem Lett 11: 2709-13 (2001)
BindingDB Entry DOI: 10.7270/Q22Z14V4
Integrin α4β7
(Homo sapiens (Human))
BDBM50105371
((S)-2-{[(S)-1-(3,5-Dichloro-benzenesulfonyl)-2-met...)
Show SMILES C[C@]1(CCCN1S(=O)(=O)c1cc(Cl)cc(Cl)c1)C(=O)N[C@@H](Cc1ccc(cc1)-c1ccccc1F)C(O)=O
Show InChI InChI=1S/C27H25Cl2FN2O5S/c1-27(11-4-12-32(27)38(36,37)21-15-19(28)14-20(29)16-21)26(35)31-24(25(33)34)13-17-7-9-18(10-8-17)22-5-2-3-6-23(22)30/h2-3,5-10,14-16,24H,4,11-13H2,1H3,(H,31,35)(H,33,34)/t24-,27-/m0/s1
NCI pathway
Reactome pathway
n/an/a>4.00E+3n/an/an/an/an/an/a
Merck Research Laboratories
Curated by ChEMBL
Assay Description
Inhibition of [125I]VCAM-Ig binding to alpha4-beta7 integrin of human RPMI-8866 cells
Bioorg Med Chem Lett 11: 2709-13 (2001)
BindingDB Entry DOI: 10.7270/Q22Z14V4